program: Orca
programVersion: 5.0.2
elementType: Cl Cl O O O N C C C C C C C C C C C C C C C C C C C C C C H H H H H H H H H H H H H H H H H H H
charge: 0
multiplicity: 1
keywords: wb97x-d3
keywords: def2-TZVPP
keywords: def2/J RIJCOSX
keywords: DEFGRID2
keywords: scfconv7
keywords: smallprint printgap noloewdin
keywords: NOSOSCF
formula: C22H19Cl2NO3
InChI: InChI=1/C22H19Cl2NO3/c1-22(2)17(12-19(23)24)20(22)21(26)28-18(13-25)14-7-6-10-16(11-14)27-15-8-4-3-5-9-15/h3-12,17-18,20H,1-2H3
47 atoms
Cl -3.40751 -4.869497 -1.305271
Cl -2.445267 -7.147772 0.177117
O  1.640923 -1.216312 0.340877
O  -0.212716 -0.935374 -0.879392
O  0.304301 4.191803 -1.288506
N  4.823219 -0.382836 0.027059
C  -1.424259 -2.286183 1.731098
C  -1.4832 -3.206172 0.544579
C  -0.177557 -2.535124 0.904828
C  -2.153337 -0.967928 1.63705
C  -1.413057 -2.855809 3.129507
C  -1.601305 -4.663514 0.681779
C  0.364798 -1.491192 0.011927
C  -2.38053 -5.44568 -0.055519
C  2.251238 -0.146529 -0.367445
C  1.769793 1.200769 0.116828
C  3.69007 -0.294671 -0.138164
C  1.258237 2.11181 -0.791329
C  1.852203 1.523723 1.46588
C  0.832191 3.358658 -0.353429
C  1.411404 2.764547 1.893431
C  0.901136 3.688563 0.993881
C  0.529478 5.537953 -1.208647
C  -0.542348 6.379747 -1.464003
C  1.790383 6.057939 -0.943021
C  -0.348218 7.752741 -1.458619
C  1.967326 7.432632 -0.931086
C  0.903218 8.285318 -1.187687
H  -1.973854 -2.783343 -0.324706
H  0.577378 -3.144804 1.388959
H  -1.660122 -0.208209 2.245744
H  -3.170031 -1.08603 2.014147
H  -2.221083 -0.588631 0.620404
H  -0.991094 -2.131186 3.827152
H  -0.825808 -3.768837 3.217704
H  -2.428329 -3.082401 3.458145
H  -1.002873 -5.158108 1.436784
H  2.069055 -0.240662 -1.443022
H  1.175625 1.861846 -1.841551
H  2.260107 0.81712 2.177041
H  1.466346 3.022201 2.942527
H  0.558759 4.654601 1.341295
H  -1.515954 5.956434 -1.672794
H  2.628435 5.399215 -0.753828
H  -1.184473 8.408381 -1.662178
H  2.949612 7.837556 -0.726456
H  1.050545 9.356654 -1.181139
totalener: -2050.66085127 hartree
nucrepener: 2656.34009231 hartree
electener: -4707.00094358 hartree
oneelecener: -8087.89064511 hartree
twoeener: 3380.88970153 hartree
kineticenergy: 2044.53559459 hartree
xcener: -151.870481104841 hartree
chargesum: 0.0000000
charge: -0.038238 -0.044615 -0.261295 -0.360622 -0.296138 -0.000482 0.063918 0.041641 -0.077405 -0.241148 -0.244316 -0.205536 0.323242 0.051713 0.312734 0.041131 -0.254052 -0.150475 -0.200012 0.184551 -0.108669 -0.136910 0.224947 -0.203278 -0.150543 -0.094715 -0.120608 -0.139214 0.086258 0.083106 0.086666 0.091867 0.101165 0.093914 0.073639 0.099953 0.097667 0.119811 0.111420 0.125421 0.130975 0.135545 0.127955 0.135532 0.126603 0.129541 0.127356
qa: -0.0382 -0.0446 -0.2613 -0.3606 -0.2961 -0.0005 0.0639 0.0416 -0.0774 -0.2411 -0.2443 -0.2055 0.3232 0.0517 0.3127 0.0411 -0.2541 -0.1505 -0.2000 0.1846 -0.1087 -0.1369 0.2249 -0.2033 -0.1505 -0.0947 -0.1206 -0.1392 0.0863 0.0831 0.0867 0.0919 0.1012 0.0939 0.0736 0.1000 0.0977 0.1198 0.1114 0.1254 0.1310 0.1355 0.1280 0.1355 0.1266 0.1295 0.1274
va: 1.2891 1.2604 2.1294 2.1477 2.1071 3.1200 3.7774 3.8326 3.8411 3.9123 3.9062 3.9225 4.2859 4.2502 3.8382 3.6333 4.0212 4.0611 4.0190 3.9283 3.9479 3.9422 3.8133 4.0335 3.9378 3.9374 3.9515 3.9570 1.0511 1.0344 1.0033 1.0021 1.0194 1.0043 1.0101 1.0029 1.0303 1.0187 1.0275 1.0189 1.0003 1.0025 1.0129 1.0029 0.9988 0.9996 0.9999
dispcorr: -0.023263423 hartree
energy: -2050.684114696325
dipole: 6.48044 -7.36393 -0.88349 39.24017 -38.20216 1.03801 15.73245 -14.65235 1.08010
magnitude: 1.73914 au
magnitude: 4.42055 debye
