program: Orca
programVersion: 5.0.2
elementType: Cl Cl O O O N C C C C C C C C C C C C C C C C C C C C C C H H H H H H H H H H H H H H H H H H H
charge: 0
multiplicity: 1
keywords: wb97x-d3
keywords: def2-TZVPP
keywords: def2/J RIJCOSX
keywords: DEFGRID2
keywords: scfconv7
keywords: smallprint printgap noloewdin
keywords: NOSOSCF
formula: C22H19Cl2NO3
InChI: InChI=1/C22H19Cl2NO3/c1-22(2)17(12-19(23)24)20(22)21(26)28-18(13-25)14-7-6-10-16(11-14)27-15-8-4-3-5-9-15/h3-12,17-18,20H,1-2H3
47 atoms
Cl -1.120973 -6.466835 -0.251855
Cl -2.782718 -6.566987 2.105126
O  0.979492 -0.521862 1.277324
O  1.364017 -1.88512 -0.455789
O  -0.189686 4.1299 -0.571164
N  2.960027 1.302509 3.200665
C  -1.774912 -2.106611 -0.342847
C  -1.146201 -3.355843 0.203617
C  -0.710861 -2.008324 0.734705
C  -1.462919 -1.724649 -1.769112
C  -3.175536 -1.726949 0.073609
C  -1.870667 -4.265468 1.10166
C  0.642375 -1.507812 0.425161
C  -1.91164 -5.587544 0.992919
C  2.171191 0.192816 0.971007
C  1.9134 1.223156 -0.101468
C  2.599107 0.811499 2.227301
C  1.021364 2.259058 0.147549
C  2.528454 1.111817 -1.338406
C  0.742732 3.179864 -0.84864
C  2.251538 2.047589 -2.325092
C  1.359896 3.080053 -2.092248
C  -0.010816 5.414482 -1.001861
C  -1.132501 6.093431 -1.454244
C  1.223097 6.049494 -0.939398
C  -1.017414 7.418773 -1.844171
C  1.324647 7.372234 -1.341585
C  0.210016 8.062489 -1.794952
H  -0.432331 -3.828408 -0.461654
H  -1.077388 -1.725145 1.715126
H  -2.207096 -2.166851 -2.433348
H  -0.483875 -2.062423 -2.098693
H  -1.505824 -0.641566 -1.897861
H  -3.379583 -1.921613 1.125645
H  -3.910709 -2.279426 -0.51348
H  -3.342858 -0.662843 -0.097758
H  -2.416458 -3.83615 1.932739
H  2.96235 -0.49121 0.648554
H  0.537519 2.361376 1.111598
H  3.208087 0.294333 -1.537929
H  2.725184 1.963459 -3.2938
H  1.140727 3.798184 -2.871771
H  -2.08648 5.583993 -1.489672
H  2.095088 5.523911 -0.571674
H  -1.894216 7.947505 -2.193936
H  2.284949 7.86797 -1.290273
H  0.29718 9.09534 -2.103314
totalener: -2050.66146349 hartree
nucrepener: 2666.95471342 hartree
electener: -4717.61617690 hartree
oneelecener: -8109.08821367 hartree
twoeener: 3391.47203677 hartree
kineticenergy: 2044.53647001 hartree
xcener: -151.870818124545 hartree
chargesum: 0.0000000
charge: -0.039029 -0.043680 -0.263402 -0.371602 -0.298455 0.000399 0.068021 0.044070 -0.087365 -0.246448 -0.240865 -0.202279 0.338492 0.047690 0.338565 0.008223 -0.269244 -0.195734 -0.124423 0.181005 -0.106831 -0.146696 0.230177 -0.205294 -0.148960 -0.094864 -0.119951 -0.140224 0.088607 0.081655 0.091387 0.100189 0.089831 0.072749 0.099493 0.095563 0.098110 0.121025 0.122747 0.116026 0.131160 0.137082 0.124990 0.136038 0.126515 0.128610 0.126929
qa: -0.0390 -0.0437 -0.2634 -0.3716 -0.2985 0.0004 0.0680 0.0441 -0.0874 -0.2464 -0.2409 -0.2023 0.3385 0.0477 0.3386 0.0082 -0.2692 -0.1957 -0.1244 0.1810 -0.1068 -0.1467 0.2302 -0.2053 -0.1490 -0.0949 -0.1200 -0.1402 0.0886 0.0817 0.0914 0.1002 0.0898 0.0727 0.0995 0.0956 0.0981 0.1210 0.1227 0.1160 0.1312 0.1371 0.1250 0.1360 0.1265 0.1286 0.1269
va: 1.2884 1.2616 2.1320 2.1332 2.1026 3.1191 3.7652 3.8314 3.8691 3.9119 3.9055 3.9129 4.2554 4.2506 3.8167 3.6560 4.0315 4.0808 3.9891 3.9040 3.9550 3.9498 3.8102 4.0334 3.9297 3.9428 3.9491 3.9576 1.0480 1.0363 1.0020 1.0208 1.0018 1.0099 1.0029 1.0042 1.0294 1.0176 1.0294 1.0180 1.0006 1.0018 1.0137 1.0031 0.9987 0.9998 1.0000
dispcorr: -0.023264732 hartree
energy: -2050.684728217982
dipole: -0.83431 0.07450 -0.75981 41.05005 -40.24978 0.80027 -16.83635 15.35683 -1.47952
magnitude: 1.84574 au
magnitude: 4.69149 debye
