program: Orca
programVersion: 5.0.2
elementType: Cl Cl O O O N C C C C C C C C C C C C C C C C C C C C C C H H H H H H H H H H H H H H H H H H H
charge: 0
multiplicity: 1
keywords: wb97x-d3
keywords: def2-TZVPP
keywords: def2/J RIJCOSX
keywords: DEFGRID2
keywords: scfconv7
keywords: smallprint printgap noloewdin
keywords: NOSOSCF
formula: C22H19Cl2NO3
InChI: InChI=1/C22H19Cl2NO3/c1-22(2)17(12-19(23)24)20(22)21(26)28-18(13-25)14-7-6-10-16(11-14)27-15-8-4-3-5-9-15/h3-12,17-18,20H,1-2H3
47 atoms
Cl -3.442056 -4.826062 -1.302359
Cl -2.488125 -7.111921 0.173997
O  1.646054 -1.19881 0.372672
O  -0.183508 -0.923434 -0.884482
O  0.26879 4.171125 -1.30226
N  4.833242 -0.363013 0.116386
C  -1.440533 -2.255556 1.713878
C  -1.488087 -3.17857 0.5291
C  -0.183708 -2.515155 0.906446
C  -2.158725 -0.93242 1.605748
C  -1.453724 -2.822564 3.113247
C  -1.618559 -4.634631 0.670006
C  0.376899 -1.475863 0.019732
C  -2.411238 -5.41058 -0.059323
C  2.268921 -0.131213 -0.328406
C  1.774404 1.217049 0.139326
C  3.70348 -0.275913 -0.069976
C  1.250576 2.109977 -0.779861
C  1.851886 1.557824 1.4844
C  0.807983 3.356218 -0.357313
C  1.394316 2.797739 1.896775
C  0.871803 3.703622 0.985747
C  0.490893 5.519056 -1.248154
C  -0.581815 6.352762 -1.525404
C  1.74888 6.048104 -0.986967
C  -0.391607 7.725979 -1.54681
C  1.921786 7.423312 -1.001998
C  0.856982 8.267594 -1.281191
H  -1.963899 -2.755732 -0.348421
H  0.560536 -3.127385 1.403758
H  -1.66924 -0.174671 2.219857
H  -3.181751 -1.04176 1.967995
H  -2.208696 -0.554854 0.587543
H  -0.872411 -3.738471 3.211414
H  -2.474837 -3.043635 3.427083
H  -1.038442 -2.098909 3.815895
H  -1.018463 -5.133707 1.420739
H  2.108398 -0.230667 -1.406967
H  1.170475 1.845847 -1.826774
H  2.26952 0.865735 2.204243
H  1.445014 3.068815 2.942727
H  0.516258 4.669278 1.320843
H  -1.553125 5.922539 -1.730146
H  2.588172 5.396442 -0.780493
H  -1.228605 8.37479 -1.76771
H  2.90187 7.835014 -0.801081
H  1.001426 9.339185 -1.295814
totalener: -2050.66085852 hartree
nucrepener: 2657.86514579 hartree
electener: -4708.52600432 hartree
oneelecener: -8090.94106540 hartree
twoeener: 3382.41506108 hartree
kineticenergy: 2044.53921087 hartree
xcener: -151.871108125956 hartree
chargesum: -0.0000000
charge: -0.038447 -0.044434 -0.260312 -0.361242 -0.296329 -0.000170 0.064009 0.042206 -0.079002 -0.241506 -0.243180 -0.205534 0.324545 0.051336 0.313001 0.036912 -0.254878 -0.147302 -0.198440 0.182688 -0.108404 -0.136742 0.225528 -0.204004 -0.149957 -0.094491 -0.121019 -0.139540 0.086408 0.083110 0.086881 0.091963 0.100995 0.073415 0.099890 0.093966 0.097919 0.119582 0.111849 0.125346 0.131167 0.135718 0.127935 0.135258 0.126692 0.129376 0.127236
qa: -0.0384 -0.0444 -0.2603 -0.3612 -0.2963 -0.0002 0.0640 0.0422 -0.0790 -0.2415 -0.2432 -0.2055 0.3245 0.0513 0.3130 0.0369 -0.2549 -0.1473 -0.1984 0.1827 -0.1084 -0.1367 0.2255 -0.2040 -0.1500 -0.0945 -0.1210 -0.1395 0.0864 0.0831 0.0869 0.0920 0.1010 0.0734 0.0999 0.0940 0.0979 0.1196 0.1118 0.1253 0.1312 0.1357 0.1279 0.1353 0.1267 0.1294 0.1272
va: 1.2888 1.2607 2.1310 2.1473 2.1067 3.1201 3.7777 3.8313 3.8442 3.9124 3.9059 3.9209 4.2849 4.2495 3.8386 3.6312 4.0212 4.0569 4.0197 3.9299 3.9467 3.9438 3.8131 4.0335 3.9353 3.9381 3.9518 3.9572 1.0510 1.0345 1.0032 1.0022 1.0194 1.0100 1.0030 1.0043 1.0299 1.0184 1.0279 1.0186 1.0002 1.0024 1.0129 1.0031 0.9987 0.9997 1.0000
dispcorr: -0.023297694 hartree
energy: -2050.684156217349
dipole: 6.48877 -7.37736 -0.88858 39.17558 -38.14237 1.03321 15.37606 -14.32991 1.04615
magnitude: 1.71800 au
magnitude: 4.36682 debye
