program: Orca
programVersion: 5.0.2
elementType: Cl Cl O O O N C C C C C C C C C C C C C C C C C C C C C C H H H H H H H H H H H H H H H H H H H
charge: 0
multiplicity: 1
keywords: wb97x-d3
keywords: def2-TZVPP
keywords: def2/J RIJCOSX
keywords: DEFGRID2
keywords: scfconv7
keywords: smallprint printgap noloewdin
keywords: NOSOSCF
formula: C22H19Cl2NO3
InChI: InChI=1/C22H19Cl2NO3/c1-22(2)17(12-19(23)24)20(22)21(26)28-18(13-25)14-7-6-10-16(11-14)27-15-8-4-3-5-9-15/h3-12,17-18,20H,1-2H3
47 atoms
Cl -0.739543 -2.121146 3.563037
Cl -3.491872 -2.974782 3.663009
O  1.199418 -1.389848 -0.530023
O  -0.224038 -0.444484 -1.971085
O  0.799645 4.429521 -0.555994
N  4.414662 -1.132013 0.164412
C  -0.671295 -3.838832 -0.691869
C  -0.838006 -3.060394 0.57693
C  -0.942917 -2.350182 -0.763982
C  0.693436 -4.405817 -1.003321
C  -1.791747 -4.724847 -1.185201
C  -2.023275 -3.164378 1.437405
C  0.018774 -1.303143 -1.170437
C  -2.071308 -2.800083 2.713214
C  2.097442 -0.303062 -0.712306
C  1.631569 0.918177 0.043214
C  3.390373 -0.779284 -0.21638
C  1.459308 2.1110 -0.637976
C  1.339363 0.824148 1.398134
C  0.975798 3.223117 0.040779
C  0.872372 1.943164 2.066426
C  0.682489 3.140086 1.394698
C  0.430689 4.515282 -1.869598
C  1.011346 5.528059 -2.618865
C  -0.523068 3.675652 -2.432571
C  0.631307 5.704004 -3.940383
C  -0.883501 3.856318 -3.759035
C  -0.312834 4.868019 -4.517517
H  0.086274 -2.873032 1.109502
H  -1.943206 -2.094112 -1.093949
H  0.763686 -5.420379 -0.608215
H  1.509461 -3.832489 -0.571636
H  0.852174 -4.461457 -2.081581
H  -1.780289 -5.684516 -0.665951
H  -1.672113 -4.922069 -2.251181
H  -2.779723 -4.284902 -1.052202
H  -2.9373 -3.564756 1.017049
H  2.209216 -0.065513 -1.775205
H  1.67882 2.166089 -1.69671
H  1.464822 -0.111796 1.927203
H  0.638551 1.881191 3.120562
H  0.304606 4.012476 1.911132
H  1.750374 6.172799 -2.161609
H  -0.977887 2.883142 -1.852027
H  1.083348 6.496449 -4.522121
H  -1.621982 3.198695 -4.197889
H  -0.602629 5.003639 -5.550589
totalener: -2050.65764040 hartree
nucrepener: 2787.49809758 hartree
electener: -4838.15573798 hartree
oneelecener: -8350.16951044 hartree
twoeener: 3512.01377246 hartree
kineticenergy: 2044.53521088 hartree
xcener: -151.871942388946 hartree
chargesum: -0.0000000
charge: -0.046888 -0.041869 -0.274480 -0.347594 -0.296578 0.003529 0.075192 0.027203 -0.056515 -0.242802 -0.271180 -0.200850 0.333193 0.057417 0.286383 0.037464 -0.263132 -0.149046 -0.186333 0.242855 -0.091969 -0.194719 0.261418 -0.222656 -0.177352 -0.084585 -0.107127 -0.150393 0.084016 0.086968 0.089724 0.098165 0.092281 0.103214 0.096972 0.076126 0.099572 0.120392 0.117245 0.116568 0.126891 0.128899 0.126320 0.135899 0.126439 0.130034 0.125691
qa: -0.0469 -0.0419 -0.2745 -0.3476 -0.2966 0.0035 0.0752 0.0272 -0.0565 -0.2428 -0.2712 -0.2009 0.3332 0.0574 0.2864 0.0375 -0.2631 -0.1490 -0.1863 0.2429 -0.0920 -0.1947 0.2614 -0.2227 -0.1774 -0.0846 -0.1071 -0.1504 0.0840 0.0870 0.0897 0.0982 0.0923 0.1032 0.0970 0.0761 0.0996 0.1204 0.1172 0.1166 0.1269 0.1289 0.1263 0.1359 0.1264 0.1300 0.1257
va: 1.2858 1.2645 2.1053 2.1603 2.1198 3.1144 3.7853 3.8038 3.8058 3.9118 3.9242 3.9138 4.2661 4.2499 3.8819 3.6339 4.0111 3.9366 4.0251 3.8669 3.9602 4.0373 3.7847 4.0500 3.9468 3.9278 3.9442 3.9644 1.0414 1.0283 1.0025 1.0129 1.0021 1.0005 1.0038 1.0088 1.0324 1.0196 1.0150 1.0220 1.0016 1.0116 1.0142 1.0078 0.9986 0.9992 1.0005
dispcorr: -0.025192196 hartree
energy: -2050.682832600952
dipole: 3.86357 -5.07896 -1.21538 1.61924 -2.05042 -0.43118 -29.36963 28.60950 -0.76013
magnitude: 1.49695 au
magnitude: 3.80495 debye
