program: Orca
programVersion: 5.0.2
elementType: Cl Cl O O O N C C C C C C C C C C C C C C C C C C C C C C H H H H H H H H H H H H H H H H H H H
charge: 0
multiplicity: 1
keywords: wb97x-d3
keywords: def2-TZVPP
keywords: def2/J RIJCOSX
keywords: DEFGRID2
keywords: scfconv7
keywords: smallprint printgap noloewdin
keywords: NOSOSCF
formula: C22H19Cl2NO3
InChI: InChI=1/C22H19Cl2NO3/c1-22(2)17(12-19(23)24)20(22)21(26)28-18(13-25)14-7-6-10-16(11-14)27-15-8-4-3-5-9-15/h3-12,17-18,20H,1-2H3
47 atoms
Cl -1.043426 -2.548519 3.612403
Cl -3.867223 -3.049138 3.30795
O  1.25547 -1.325339 -0.396803
O  0.004256 -0.343614 -1.968077
O  0.899613 4.408643 -0.588317
N  4.434036 -1.319977 0.459472
C  -0.646016 -3.719362 -0.762158
C  -0.919888 -2.954519 0.498964
C  -0.879355 -2.224021 -0.83279
C  0.730441 -4.313036 -0.947994
C  -1.731491 -4.575493 -1.37282
C  -2.18991 -3.053062 1.227587
C  0.144591 -1.203282 -1.143302
C  -2.33755 -2.901839 2.538319
C  2.243632 -0.311123 -0.545761
C  1.833505 0.952828 0.168292
C  3.466463 -0.883284 0.021507
C  1.592557 2.098784 -0.571582
C  1.641958 0.942689 1.544429
C  1.137825 3.244951 0.069332
C  1.206771 2.096218 2.174087
C  0.945182 3.244524 1.443672
C  0.406722 4.409207 -1.863321
C  0.877913 5.398422 -2.714121
C  -0.561395 3.510351 -2.293335
C  0.372704 5.49126 -4.001318
C  -1.048179 3.608821 -3.587557
C  -0.587786 4.595352 -4.446502
H  -0.050127 -2.798112 1.124607
H  -1.837148 -1.94059 -1.254336
H  1.510831 -3.773549 -0.418433
H  0.9989 -4.346146 -2.005333
H  0.734776 -5.338692 -0.576323
H  -2.718619 -4.116829 -1.330236
H  -1.789952 -5.539647 -0.865658
H  -1.512418 -4.765121 -2.424289
H  -3.090754 -3.262848 0.664681
H  2.426191 -0.101961 -1.604693
H  1.734188 2.08902 -1.644653
H  1.830597 0.046248 2.121474
H  1.056032 2.100707 3.245015
H  0.591854 4.143324 1.931336
H  1.630447 6.091154 -2.361208
H  -0.931795 2.734285 -1.6365
H  0.740437 6.266064 -4.660865
H  -1.797626 2.904022 -3.921598
H  -0.976213 4.666333 -5.453247
totalener: -2050.65848642 hartree
nucrepener: 2778.42326351 hartree
electener: -4829.08174993 hartree
oneelecener: -8332.04321376 hartree
twoeener: 3502.96146382 hartree
kineticenergy: 2044.53894574 hartree
xcener: -151.872852585879 hartree
chargesum: 0.0000000
charge: -0.042874 -0.043136 -0.269407 -0.355861 -0.296803 0.002656 0.070527 0.058539 -0.080712 -0.245382 -0.262530 -0.217392 0.356507 0.059364 0.295866 0.027254 -0.269034 -0.153101 -0.188452 0.245774 -0.089115 -0.198953 0.264060 -0.224366 -0.170051 -0.084168 -0.104072 -0.151045 0.080929 0.083457 0.097360 0.092682 0.089888 0.075596 0.101576 0.096173 0.097231 0.119209 0.123048 0.117872 0.129535 0.128974 0.124934 0.129575 0.125650 0.127107 0.125112
qa: -0.0429 -0.0431 -0.2694 -0.3559 -0.2968 0.0027 0.0705 0.0585 -0.0807 -0.2454 -0.2625 -0.2174 0.3565 0.0594 0.2959 0.0273 -0.2690 -0.1531 -0.1885 0.2458 -0.0891 -0.1990 0.2641 -0.2244 -0.1701 -0.0842 -0.1041 -0.1510 0.0809 0.0835 0.0974 0.0927 0.0899 0.0756 0.1016 0.0962 0.0972 0.1192 0.1230 0.1179 0.1295 0.1290 0.1249 0.1296 0.1256 0.1271 0.1251
va: 1.2857 1.2625 2.1129 2.1500 2.1199 3.1130 3.7557 3.7853 3.8411 3.9175 3.9235 3.9323 4.2473 4.2528 3.8713 3.6085 4.0107 3.9288 4.0345 3.8657 3.9463 4.0413 3.7843 4.0473 3.9424 3.9277 3.9479 3.9646 1.0458 1.0300 1.0125 1.0017 1.0026 1.0101 1.0012 1.0035 1.0330 1.0183 1.0168 1.0187 0.9993 1.0117 1.0144 1.0114 0.9987 1.0000 1.0005
dispcorr: -0.024741428 hartree
energy: -2050.683227852495
dipole: 5.66832 -6.78962 -1.12130 3.51146 -3.79579 -0.28434 -29.03785 28.23194 -0.80590
magnitude: 1.40984 au
magnitude: 3.58352 debye
