program: Orca
programVersion: 5.0.2
elementType: Cl Cl O O O N C C C C C C C C C C C C C C C C C C C C C C H H H H H H H H H H H H H H H H H H H
charge: 0
multiplicity: 1
keywords: wb97x-d3
keywords: def2-TZVPP
keywords: def2/J RIJCOSX
keywords: DEFGRID2
keywords: scfconv7
keywords: smallprint printgap noloewdin
keywords: NOSOSCF
formula: C22H19Cl2NO3
InChI: InChI=1/C22H19Cl2NO3/c1-22(2)17(12-19(23)24)20(22)21(26)28-18(13-25)14-7-6-10-16(11-14)27-15-8-4-3-5-9-15/h3-12,17-18,20H,1-2H3
47 atoms
Cl -1.97068 0.146768 1.905821
Cl -4.540539 -0.235534 0.656226
O  1.738658 -1.613226 0.188145
O  1.890442 -1.466016 -2.037817
O  0.870249 3.345156 0.204067
N  3.828503 -1.620155 2.740285
C  -0.605549 -3.542059 -0.473778
C  -1.039068 -2.243751 0.133345
C  -0.141511 -2.237526 -1.09205
C  0.346443 -4.411961 0.312592
C  -1.574326 -4.346783 -1.30806
C  -2.416303 -1.737314 0.041381
C  1.251052 -1.741126 -1.063148
C  -2.901513 -0.739208 0.769755
C  3.036041 -1.063427 0.313206
C  3.063616 0.431334 0.076845
C  3.46451 -1.380186 1.678021
C  1.929211 1.194318 0.297251
C  4.241642 1.026788 -0.351584
C  1.965866 2.557695 0.032784
C  4.279255 2.395404 -0.559523
C  3.140547 3.165271 -0.383872
C  -0.341504 2.939654 -0.281127
C  -0.472579 2.132047 -1.405056
C  -1.466018 3.41487 0.378073
C  -1.741156 1.791423 -1.849332
C  -2.725866 3.072418 -0.084267
C  -2.871998 2.256798 -1.196482
H  -0.53288 -1.990968 1.057348
H  -0.614011 -1.997222 -2.037583
H  0.987052 -4.988841 -0.356694
H  -0.22126 -5.121428 0.916419
H  0.984489 -3.850374 0.990363
H  -2.231349 -4.940182 -0.670123
H  -1.030162 -5.035248 -1.9558
H  -2.200569 -3.731401 -1.953396
H  -3.100066 -2.206392 -0.6547
H  3.731045 -1.548775 -0.381259
H  1.010917 0.74161 0.651115
H  5.125168 0.426252 -0.528195
H  5.195864 2.864959 -0.88983
H  3.152697 4.229898 -0.575356
H  0.398032 1.769331 -1.936053
H  -1.346473 4.0442 1.250171
H  -1.839847 1.162326 -2.724328
H  -3.599875 3.439422 0.436983
H  -3.857093 1.984741 -1.548448
totalener: -2050.65639251 hartree
nucrepener: 2984.01921760 hartree
electener: -5034.67561012 hartree
oneelecener: -8743.31953737 hartree
twoeener: 3708.64392725 hartree
kineticenergy: 2044.54119904 hartree
xcener: -151.877525735775 hartree
chargesum: 0.0000000
charge: -0.042156 -0.053324 -0.280395 -0.331488 -0.297453 0.004766 0.082118 0.038773 -0.054408 -0.249626 -0.277871 -0.217161 0.301407 0.078968 0.264969 0.114835 -0.257967 -0.177847 -0.187411 0.225471 -0.082570 -0.200343 0.273513 -0.168473 -0.217557 -0.134415 -0.091335 -0.151528 0.097244 0.086584 0.094614 0.091033 0.097346 0.104518 0.098181 0.074358 0.101907 0.130936 0.107531 0.108129 0.128287 0.129186 0.138148 0.123371 0.124804 0.123520 0.128812
qa: -0.0422 -0.0533 -0.2804 -0.3315 -0.2975 0.0048 0.0821 0.0388 -0.0544 -0.2496 -0.2779 -0.2172 0.3014 0.0790 0.2650 0.1148 -0.2580 -0.1778 -0.1874 0.2255 -0.0826 -0.2003 0.2735 -0.1685 -0.2176 -0.1344 -0.0913 -0.1515 0.0972 0.0866 0.0946 0.0910 0.0973 0.1045 0.0982 0.0744 0.1019 0.1309 0.1075 0.1081 0.1283 0.1292 0.1381 0.1234 0.1248 0.1235 0.1288
va: 1.2890 1.2505 2.0829 2.1708 2.1214 3.1174 3.8230 3.7528 3.8029 3.9113 3.9221 3.9414 4.2606 4.2276 3.8481 3.6103 3.9984 3.9856 4.0553 3.8387 3.9428 4.0507 3.7634 3.8827 3.9966 3.9106 3.9070 3.8756 1.0370 1.0278 1.0011 1.0035 1.0127 0.9999 1.0039 1.0077 1.0319 1.0154 1.0295 1.0120 0.9992 1.0107 1.0065 1.0146 1.0019 1.0022 1.0065
dispcorr: -0.030777562 hartree
energy: -2050.687170074593
dipole: 8.98677 -9.64074 -0.65397 -13.67823 13.13411 -0.54412 -14.39977 13.24356 -1.15621
magnitude: 1.43547 au
magnitude: 3.64868 debye
