program: Orca
programVersion: 5.0.2
elementType: Cl Cl O O O N C C C C C C C C C C C C C C C C C C C C C C H H H H H H H H H H H H H H H H H H H
charge: 0
multiplicity: 1
keywords: wb97x-d3
keywords: def2-TZVPP
keywords: def2/J RIJCOSX
keywords: DEFGRID2
keywords: scfconv7
keywords: smallprint printgap noloewdin
keywords: NOSOSCF
formula: C22H19Cl2NO3
InChI: InChI=1/C22H19Cl2NO3/c1-22(2)17(12-19(23)24)20(22)21(26)28-18(13-25)14-7-6-10-16(11-14)27-15-8-4-3-5-9-15/h3-12,17-18,20H,1-2H3
47 atoms
Cl -2.724399 -5.402493 -1.568938
Cl -1.924287 -7.338451 0.414753
O  1.392725 -0.977227 0.741511
O  -0.129832 -0.97705 -0.898025
O  0.20577 4.220288 -1.534043
N  4.563041 -0.066432 0.93644
C  -1.87899 -2.248766 1.403536
C  -1.477134 -3.287951 0.397289
C  -0.420821 -2.39485 1.01161
C  -2.693563 -1.074055 0.918355
C  -2.229764 -2.667496 2.811337
C  -1.473586 -4.722165 0.716218
C  0.250749 -1.391794 0.160769
C  -1.974923 -5.683938 -0.049358
C  2.102217 0.052989 0.066335
C  1.514861 1.416533 0.342334
C  3.478042 -0.026931 0.56268
C  1.118212 2.220846 -0.713187
C  1.392618 1.864958 1.652275
C  0.606049 3.486921 -0.46096
C  0.86757 3.122933 1.892149
C  0.472878 3.941062 0.84463
C  0.415285 5.572209 -1.537139
C  -0.623511 6.385209 -1.963009
C  1.640944 6.119934 -1.178562
C  -0.43132 7.757112 -2.033753
C  1.815656 7.492825 -1.244931
C  0.783907 8.317211 -1.670727
H  -1.728795 -3.040758 -0.627796
H  0.216522 -2.835729 1.770016
H  -2.507529 -0.192412 1.534162
H  -3.755241 -1.312823 0.995775
H  -2.488648 -0.809188 -0.115767
H  -1.585718 -3.455181 3.200042
H  -3.257844 -3.02977 2.856431
H  -2.145358 -1.817088 3.489171
H  -1.027358 -5.037456 1.65133
H  2.120268 -0.132616 -1.012362
H  1.197503 1.873867 -1.735752
H  1.712302 1.243023 2.478462
H  0.765444 3.478608 2.90855
H  0.065941 4.923675 1.045051
H  -1.569962 5.941632 -2.2425
H  2.453899 5.482061 -0.855772
H  -1.241871 8.390318 -2.369263
H  2.770678 7.918516 -0.966979
H  0.928263 9.387664 -1.722736
totalener: -2050.66106611 hartree
nucrepener: 2647.01332396 hartree
electener: -4697.67439008 hartree
oneelecener: -8069.24583287 hartree
twoeener: 3371.57144280 hartree
kineticenergy: 2044.52981686 hartree
xcener: -151.869088403164 hartree
chargesum: -0.0000000
charge: -0.038386 -0.043752 -0.263845 -0.367813 -0.297035 -0.000054 0.065732 0.044301 -0.093383 -0.244357 -0.240951 -0.203119 0.338846 0.049326 0.315656 0.026474 -0.255652 -0.146999 -0.183478 0.171149 -0.115692 -0.126283 0.212019 -0.197131 -0.139791 -0.098026 -0.122619 -0.136739 0.087863 0.083500 0.088024 0.091122 0.101891 0.073021 0.100236 0.094000 0.098117 0.119791 0.114214 0.125579 0.131107 0.136134 0.128118 0.135303 0.127010 0.129369 0.127203
qa: -0.0384 -0.0438 -0.2638 -0.3678 -0.2970 -0.0001 0.0657 0.0443 -0.0934 -0.2444 -0.2410 -0.2031 0.3388 0.0493 0.3157 0.0265 -0.2557 -0.1470 -0.1835 0.1711 -0.1157 -0.1263 0.2120 -0.1971 -0.1398 -0.0980 -0.1226 -0.1367 0.0879 0.0835 0.0880 0.0911 0.1019 0.0730 0.1002 0.0940 0.0981 0.1198 0.1142 0.1256 0.1311 0.1361 0.1281 0.1353 0.1270 0.1294 0.1272
va: 1.2887 1.2614 2.1312 2.1395 2.1038 3.1199 3.7701 3.8260 3.8694 3.9144 3.9069 3.9142 4.2601 4.2499 3.8356 3.6493 4.0220 4.0512 4.0200 3.9358 3.9560 3.9313 3.8246 4.0295 3.9328 3.9391 3.9522 3.9540 1.0495 1.0354 1.0025 1.0015 1.0203 1.0099 1.0029 1.0047 1.0293 1.0199 1.0270 1.0178 1.0006 1.0024 1.0124 1.0027 0.9987 0.9997 0.9999
dispcorr: -0.022978226 hartree
energy: -2050.684044338208
dipole: -0.49859 -0.66937 -1.16796 41.63186 -40.50590 1.12596 11.95221 -11.17099 0.78123
magnitude: 1.80062 au
magnitude: 4.57681 debye
