program: Orca
programVersion: 5.0.2
elementType: Cl Cl O O O N C C C C C C C C C C C C C C C C C C C C C C H H H H H H H H H H H H H H H H H H H
charge: 0
multiplicity: 1
keywords: wb97x-d3
keywords: def2-TZVPP
keywords: def2/J RIJCOSX
keywords: DEFGRID2
keywords: scfconv7
keywords: smallprint printgap noloewdin
keywords: NOSOSCF
formula: C22H19Cl2NO3
InChI: InChI=1/C22H19Cl2NO3/c1-22(2)17(12-19(23)24)20(22)21(26)28-18(13-25)14-7-6-10-16(11-14)27-15-8-4-3-5-9-15/h3-12,17-18,20H,1-2H3
47 atoms
Cl -1.351039 0.043281 1.10674
Cl -4.091729 -0.869792 1.249836
O  2.052724 -2.12405 -0.09399
O  1.293443 -1.905729 -2.188502
O  0.838515 3.049694 -1.563408
N  5.102217 -1.693161 1.121535
C  -0.111372 -4.245752 0.352314
C  -0.600575 -2.89551 0.753884
C  -0.024508 -3.106604 -0.642926
C  1.113151 -4.804139 1.037825
C  -1.116634 -5.316302 -0.007297
C  -2.023241 -2.537593 0.899027
C  1.15941 -2.340451 -1.078542
C  -2.43706 -1.287073 1.065311
C  3.006504 -1.087094 -0.314633
C  2.401053 0.236887 0.082406
C  4.174545 -1.433722 0.495941
C  1.908929 1.077697 -0.903842
C  2.236519 0.557554 1.42507
C  1.255253 2.251403 -0.547743
C  1.582887 1.727878 1.767589
C  1.087039 2.579798 0.791823
C  -0.259769 3.84811 -1.386884
C  -1.481637 3.313529 -0.998996
C  -0.131074 5.201351 -1.654806
C  -2.57832 4.15088 -0.874306
C  -1.239851 6.026936 -1.535907
C  -2.46332 5.508375 -1.140463
H  0.063579 -2.355352 1.420459
H  -0.752755 -3.15908 -1.443667
H  1.663921 -5.466072 0.36805
H  0.80612 -5.39309 1.903505
H  1.798247 -4.03801 1.389357
H  -1.492493 -5.808463 0.891614
H  -0.649956 -6.079454 -0.630998
H  -1.97247 -4.928825 -0.560266
H  -2.777014 -3.314901 0.874259
H  3.319369 -1.066726 -1.362498
H  2.013603 0.825767 -1.951384
H  2.620393 -0.094862 2.198908
H  1.457829 1.988141 2.809904
H  0.583578 3.494274 1.076308
H  -1.578118 2.253465 -0.802552
H  0.828049 5.598015 -1.960603
H  -3.530432 3.734701 -0.572893
H  -1.141534 7.08321 -1.748306
H  -3.324143 6.15614 -1.045231
totalener: -2050.65642098 hartree
nucrepener: 2898.33918929 hartree
electener: -4948.99561027 hartree
oneelecener: -8571.88664731 hartree
twoeener: 3622.89103704 hartree
kineticenergy: 2044.53594095 hartree
xcener: -151.872585603660 hartree
chargesum: 0.0000000
charge: -0.043603 -0.042418 -0.268098 -0.349526 -0.294548 -0.001934 0.111719 -0.045761 -0.054911 -0.232956 -0.278208 -0.203744 0.323181 0.074836 0.297278 0.015973 -0.265100 -0.135924 -0.178006 0.202656 -0.139528 -0.148534 0.200716 -0.128171 -0.179442 -0.137213 -0.107719 -0.124376 0.101067 0.091377 0.093546 0.086251 0.094833 0.101272 0.099065 0.076157 0.116402 0.125354 0.124588 0.118194 0.129848 0.133247 0.133149 0.126791 0.128501 0.126767 0.126951
qa: -0.0436 -0.0424 -0.2681 -0.3495 -0.2945 -0.0019 0.1117 -0.0458 -0.0549 -0.2330 -0.2782 -0.2037 0.3232 0.0748 0.2973 0.0160 -0.2651 -0.1359 -0.1780 0.2027 -0.1395 -0.1485 0.2007 -0.1282 -0.1794 -0.1372 -0.1077 -0.1244 0.1011 0.0914 0.0935 0.0863 0.0948 0.1013 0.0991 0.0762 0.1164 0.1254 0.1246 0.1182 0.1298 0.1332 0.1331 0.1268 0.1285 0.1268 0.1270
va: 1.3196 1.2663 2.0929 2.1540 2.1082 3.1114 3.7895 3.8496 3.7976 3.8936 3.9237 3.8847 4.2680 4.2204 3.8524 3.6441 4.0183 4.0182 3.9796 3.8835 3.9432 3.8770 3.8283 3.9237 4.0233 3.9747 3.9391 3.9433 1.0261 1.0268 1.0037 1.0024 1.0161 0.9989 1.0055 1.0044 1.0210 1.0204 1.0305 1.0180 1.0032 1.0073 1.0262 1.0120 1.0014 0.9990 0.9996
dispcorr: -0.027918447 hartree
energy: -2050.684339424276
dipole: 5.13287 -6.63948 -1.50662 -9.19115 9.04709 -0.14405 -2.76207 3.08042 0.31835
magnitude: 1.54661 au
magnitude: 3.93116 debye
