program: Orca
programVersion: 5.0.2
elementType: Cl Cl O O O N C C C C C C C C C C C C C C C C C C C C C C H H H H H H H H H H H H H H H H H H H
charge: 0
multiplicity: 1
keywords: wb97x-d3
keywords: def2-TZVPP
keywords: def2/J RIJCOSX
keywords: DEFGRID2
keywords: scfconv7
keywords: smallprint printgap noloewdin
keywords: NOSOSCF
formula: C22H19Cl2NO3
InChI: InChI=1/C22H19Cl2NO3/c1-22(2)17(12-19(23)24)20(22)21(26)28-18(13-25)14-7-6-10-16(11-14)27-15-8-4-3-5-9-15/h3-12,17-18,20H,1-2H3
47 atoms
Cl -2.556194 0.218808 -0.539742
Cl -4.152535 -1.123092 -2.534195
O  1.574693 -1.595851 0.569111
O  2.625781 -2.408931 -1.228263
O  0.731391 3.403912 -0.569857
N  2.593619 -0.384341 3.469298
C  -0.474401 -3.830016 0.059363
C  -0.983682 -2.488806 -0.372229
C  0.355461 -2.99074 -0.891022
C  -0.078218 -4.008418 1.506209
C  -1.062026 -5.087837 -0.537373
C  -2.106963 -2.324364 -1.303886
C  1.633391 -2.324422 -0.562067
C  -2.835514 -1.22174 -1.433032
C  2.731756 -0.842878 0.899669
C  2.793118 0.458097 0.136455
C  2.641735 -0.59467 2.341223
C  1.694189 1.309842 0.159241
C  3.935999 0.792044 -0.569517
C  1.759798 2.520496 -0.51479
C  3.986334 2.003313 -1.245652
C  2.910491 2.869836 -1.216667
C  -0.24503 3.398162 0.388984
C  0.061856 3.473428 1.74159
C  -1.563541 3.373807 -0.03753
C  -0.967477 3.511534 2.668673
C  -2.584592 3.424597 0.900604
C  -2.291721 3.487049 2.254414
H  -0.909536 -1.716439 0.383591
H  0.36804 -3.352083 -1.912911
H  0.733489 -4.732014 1.600025
H  -0.928832 -4.394945 2.069418
H  0.235919 -3.086097 1.987095
H  -0.369065 -5.920815 -0.412345
H  -1.268063 -5.004127 -1.603939
H  -1.994246 -5.352277 -0.035799
H  -2.37644 -3.156859 -1.941621
H  3.640075 -1.424312 0.712299
H  0.797747 1.028628 0.698438
H  4.777782 0.112982 -0.600149
H  4.87411 2.274554 -1.800818
H  2.945487 3.817014 -1.738408
H  1.093082 3.500896 2.070148
H  -1.782718 3.321059 -1.09571
H  -0.728838 3.565386 3.722393
H  -3.613801 3.408273 0.567114
H  -3.090162 3.519858 2.983178
totalener: -2050.65869494 hartree
nucrepener: 2894.43031712 hartree
electener: -4945.08901206 hartree
oneelecener: -8564.25022597 hartree
twoeener: 3619.16121391 hartree
kineticenergy: 2044.53248775 hartree
xcener: -151.872490734821 hartree
chargesum: 0.0000000
charge: -0.039541 -0.046761 -0.282065 -0.340103 -0.294485 -0.000571 0.081484 0.034272 -0.066602 -0.245876 -0.272473 -0.208169 0.333026 0.057525 0.296776 0.040802 -0.266826 -0.201463 -0.150603 0.256198 -0.081508 -0.210322 0.319183 -0.192111 -0.315226 -0.097823 -0.081985 -0.135058 0.085454 0.086918 0.092949 0.089055 0.097367 0.097220 0.076490 0.102885 0.099556 0.123793 0.119646 0.109424 0.127498 0.128500 0.136808 0.139807 0.132005 0.137128 0.127802
qa: -0.0395 -0.0468 -0.2821 -0.3401 -0.2945 -0.0006 0.0815 0.0343 -0.0666 -0.2459 -0.2725 -0.2082 0.3330 0.0575 0.2968 0.0408 -0.2668 -0.2015 -0.1506 0.2562 -0.0815 -0.2103 0.3192 -0.1921 -0.3152 -0.0978 -0.0820 -0.1351 0.0855 0.0869 0.0929 0.0891 0.0974 0.0972 0.0765 0.1029 0.0996 0.1238 0.1196 0.1094 0.1275 0.1285 0.1368 0.1398 0.1320 0.1371 0.1278
va: 1.3022 1.2603 2.1000 2.1713 2.1242 3.1152 3.7656 3.8061 3.8136 3.9163 3.9250 3.9224 4.2796 4.2558 3.8721 3.6683 4.0132 3.9586 4.0199 3.8312 3.9510 4.0341 3.6779 3.9827 3.9932 3.9347 3.8482 3.9613 1.0361 1.0292 1.0018 1.0027 1.0122 1.0035 1.0089 1.0004 1.0328 1.0205 1.0252 1.0143 0.9998 1.0123 1.0028 1.0165 0.9987 0.9974 0.9993
dispcorr: -0.026749426 hartree
energy: -2050.685444362453
dipole: 11.65195 -12.01577 -0.36382 -11.48254 10.84474 -0.63781 10.22599 -10.70565 -0.47966
magnitude: 0.87706 au
magnitude: 2.22931 debye
