program: Orca
programVersion: 5.0.2
elementType: Cl Cl O O O N C C C C C C C C C C C C C C C C C C C C C C H H H H H H H H H H H H H H H H H H H
charge: 0
multiplicity: 1
keywords: wb97x-d3
keywords: def2-TZVPP
keywords: def2/J RIJCOSX
keywords: DEFGRID2
keywords: scfconv7
keywords: smallprint printgap noloewdin
keywords: NOSOSCF
formula: C22H19Cl2NO3
InChI: InChI=1/C22H19Cl2NO3/c1-22(2)17(12-19(23)24)20(22)21(26)28-18(13-25)14-7-6-10-16(11-14)27-15-8-4-3-5-9-15/h3-12,17-18,20H,1-2H3
47 atoms
Cl -1.439793 0.00787 1.449108
Cl -3.846245 -1.181252 2.527822
O  1.657939 -1.609183 -0.648155
O  0.363991 -0.699941 -2.231449
O  0.413049 3.806027 -0.104845
N  4.919788 -1.517571 -0.105146
C  -0.435167 -3.851268 -0.445703
C  -0.659688 -2.798816 0.585465
C  -0.555132 -2.400934 -0.876512
C  0.886584 -4.580123 -0.478902
C  -1.598408 -4.725881 -0.853331
C  -1.948212 -2.608892 1.285112
C  0.511887 -1.495959 -1.345781
C  -2.363441 -1.4181 1.698248
C  2.593692 -0.540794 -0.780897
C  2.172108 0.5996 0.112186
C  3.892196 -1.098396 -0.400638
C  1.547393 1.699842 -0.457825
C  2.304291 0.493351 1.490307
C  1.026065 2.691827 0.36485
C  1.799891 1.498677 2.297925
C  1.151142 2.589534 1.744949
C  -0.16162 3.824901 -1.347299
C  0.119141 4.913638 -2.158101
C  -1.039995 2.834466 -1.768015
C  -0.489051 5.014759 -3.399999
C  -1.628939 2.941341 -3.018004
C  -1.360222 4.028749 -3.836807
H  0.21233 -2.541331 1.179605
H  -1.493334 -2.158225 -1.36183
H  1.138564 -4.877408 -1.497931
H  0.815629 -5.489923 0.119406
H  1.713369 -3.994778 -0.0865
H  -2.546674 -4.188044 -0.867649
H  -1.702781 -5.568975 -0.167746
H  -1.438154 -5.131956 -1.852661
H  -2.578531 -3.465772 1.490024
H  2.659797 -0.210146 -1.821643
H  1.450624 1.766879 -1.533299
H  2.798092 -0.362349 1.932706
H  1.900277 1.428047 3.372359
H  0.744811 3.370678 2.373687
H  0.804136 5.675704 -1.810617
H  -1.261465 1.98501 -1.134341
H  -0.27307 5.866979 -4.030559
H  -2.306386 2.166003 -3.349384
H  -1.828229 4.106457 -4.808697
totalener: -2050.65605138 hartree
nucrepener: 2928.54879557 hartree
electener: -4979.20484696 hartree
oneelecener: -8632.48764894 hartree
twoeener: 3653.28280198 hartree
kineticenergy: 2044.54058303 hartree
xcener: -151.873523453217 hartree
chargesum: -0.0000000
charge: -0.038032 -0.039128 -0.265967 -0.353675 -0.292298 -0.000970 0.121965 -0.035338 -0.091059 -0.241415 -0.278988 -0.243629 0.330596 0.100332 0.300280 0.029580 -0.269505 -0.166386 -0.210357 0.266426 -0.073013 -0.228453 0.258594 -0.206880 -0.150735 -0.095227 -0.108321 -0.138282 0.109015 0.097116 0.094120 0.085085 0.097470 0.083989 0.097215 0.098215 0.121289 0.123039 0.133392 0.115806 0.127256 0.126839 0.125232 0.108970 0.125754 0.124932 0.125146
qa: -0.0380 -0.0391 -0.2660 -0.3537 -0.2923 -0.0010 0.1220 -0.0353 -0.0911 -0.2414 -0.2790 -0.2436 0.3306 0.1003 0.3003 0.0296 -0.2695 -0.1664 -0.2104 0.2664 -0.0730 -0.2285 0.2586 -0.2069 -0.1507 -0.0952 -0.1083 -0.1383 0.1090 0.0971 0.0941 0.0851 0.0975 0.0840 0.0972 0.0982 0.1213 0.1230 0.1334 0.1158 0.1273 0.1268 0.1252 0.1090 0.1258 0.1249 0.1251
va: 1.3189 1.2687 2.0960 2.1412 2.1248 3.1120 3.7385 3.8495 3.8283 3.8996 3.9208 3.8895 4.2216 4.1977 3.8647 3.6136 4.0136 3.9194 4.0187 3.8245 3.9297 4.0068 3.7603 4.0454 3.9533 3.9310 3.9705 3.9537 1.0214 1.0231 1.0024 1.0030 1.0141 1.0016 0.9997 1.0059 1.0154 1.0187 1.0182 1.0187 0.9997 1.0148 1.0135 1.0211 0.9991 1.0004 1.0003
dispcorr: -0.028647210 hartree
energy: -2050.684698591957
dipole: 6.46034 -7.66074 -1.20041 -10.80458 10.23747 -0.56711 -16.14114 16.07249 -0.06865
magnitude: 1.32940 au
magnitude: 3.37907 debye
