program: Orca
programVersion: 5.0.2
elementType: Cl Cl O O O N C C C C C C C C C C C C C C C C C C C C C C H H H H H H H H H H H H H H H H H H H
charge: 0
multiplicity: 1
keywords: wb97x-d3
keywords: def2-TZVPP
keywords: def2/J RIJCOSX
keywords: DEFGRID2
keywords: scfconv7
keywords: smallprint printgap noloewdin
keywords: NOSOSCF
formula: C22H19Cl2NO3
InChI: InChI=1/C22H19Cl2NO3/c1-22(2)17(12-19(23)24)20(22)21(26)28-18(13-25)14-7-6-10-16(11-14)27-15-8-4-3-5-9-15/h3-12,17-18,20H,1-2H3
47 atoms
Cl -1.418127 0.011761 1.469331
Cl -3.831097 -1.16762 2.544703
O  1.668988 -1.626317 -0.64836
O  0.367784 -0.723834 -2.229693
O  0.405359 3.781261 -0.090928
N  4.934036 -1.526079 -0.125207
C  -0.424323 -3.862866 -0.414088
C  -0.649881 -2.798309 0.604269
C  -0.545706 -2.418275 -0.863065
C  0.897535 -4.592093 -0.436897
C  -1.587121 -4.742927 -0.811312
C  -1.938337 -2.602442 1.302192
C  0.519209 -1.515029 -1.340266
C  -2.348464 -1.410244 1.716377
C  2.601188 -0.555277 -0.785061
C  2.179769 0.582398 0.111561
C  3.903251 -1.109197 -0.411888
C  1.547379 1.680821 -0.453405
C  2.319716 0.474488 1.488858
C  1.025844 2.669058 0.373726
C  1.815274 1.476216 2.30081
C  1.158629 2.565057 1.75297
C  -0.179825 3.798313 -1.328509
C  0.085011 4.891792 -2.138295
C  -1.053157 2.801653 -1.745019
C  -0.534016 4.99122 -3.374977
C  -1.652829 2.906898 -2.990058
C  -1.399993 3.99888 -3.807836
H  0.222073 -2.531831 1.194605
H  -1.484166 -2.182578 -1.351313
H  1.150887 -4.901692 -1.45194
H  0.825298 -5.494574 0.172209
H  1.723907 -4.002369 -0.050318
H  -1.693212 -5.576569 -0.114462
H  -1.425148 -5.162651 -1.804754
H  -2.535264 -4.205134 -0.835123
H  -2.57336 -3.4563 1.505019
H  2.661012 -0.223336 -1.825739
H  1.444794 1.749318 -1.528288
H  2.819558 -0.379888 1.927174
H  1.921475 1.40409 3.374624
H  0.751878 3.343235 2.385123
H  0.766225 5.658731 -1.794027
H  -1.262646 1.948731 -1.11197
H  -0.330468 5.847094 -4.004758
H  -2.326088 2.126586 -3.318332
H  -1.876185 4.075216 -4.775878
totalener: -2050.65597914 hartree
nucrepener: 2930.55983199 hartree
electener: -4981.21581113 hartree
oneelecener: -8636.50060518 hartree
twoeener: 3655.28479405 hartree
kineticenergy: 2044.54027710 hartree
xcener: -151.873512092967 hartree
chargesum: 0.0000000
charge: -0.037515 -0.039148 -0.266098 -0.353518 -0.292142 -0.000469 0.122090 -0.038032 -0.088097 -0.240522 -0.279449 -0.241073 0.329126 0.098783 0.300517 0.030483 -0.269948 -0.166102 -0.211283 0.265335 -0.071813 -0.229554 0.259231 -0.207172 -0.150602 -0.095201 -0.108862 -0.138482 0.109068 0.096595 0.094070 0.085075 0.097179 0.097356 0.098280 0.083827 0.121250 0.123168 0.133604 0.115999 0.127257 0.126809 0.125305 0.108740 0.125755 0.124973 0.125205
qa: -0.0375 -0.0391 -0.2661 -0.3535 -0.2921 -0.0005 0.1221 -0.0380 -0.0881 -0.2405 -0.2794 -0.2411 0.3291 0.0988 0.3005 0.0305 -0.2699 -0.1661 -0.2113 0.2653 -0.0718 -0.2296 0.2592 -0.2072 -0.1506 -0.0952 -0.1089 -0.1385 0.1091 0.0966 0.0941 0.0851 0.0972 0.0974 0.0983 0.0838 0.1213 0.1232 0.1336 0.1160 0.1273 0.1268 0.1253 0.1087 0.1258 0.1250 0.1252
va: 1.3197 1.2686 2.0960 2.1413 2.1249 3.1122 3.7403 3.8522 3.8257 3.8990 3.9211 3.8877 4.2237 4.1988 3.8645 3.6122 4.0140 3.9187 4.0181 3.8233 3.9277 4.0047 3.7591 4.0454 3.9516 3.9310 3.9725 3.9538 1.0213 1.0232 1.0025 1.0030 1.0144 0.9996 1.0059 1.0016 1.0154 1.0187 1.0180 1.0187 0.9997 1.0149 1.0135 1.0217 0.9990 1.0004 1.0003
dispcorr: -0.028707131 hartree
energy: -2050.684686274043
dipole: 6.33751 -7.54224 -1.20473 -10.94905 10.38063 -0.56842 -15.98326 15.93303 -0.05023
magnitude: 1.33304 au
magnitude: 3.38832 debye
