program: Orca
programVersion: 5.0.2
elementType: Cl Cl O O O N C C C C C C C C C C C C C C C C C C C C C C H H H H H H H H H H H H H H H H H H H
charge: 0
multiplicity: 1
keywords: wb97x-d3
keywords: def2-TZVPP
keywords: def2/J RIJCOSX
keywords: DEFGRID2
keywords: scfconv7
keywords: smallprint printgap noloewdin
keywords: NOSOSCF
formula: C22H19Cl2NO3
InChI: InChI=1/C22H19Cl2NO3/c1-22(2)17(12-19(23)24)20(22)21(26)28-18(13-25)14-7-6-10-16(11-14)27-15-8-4-3-5-9-15/h3-12,17-18,20H,1-2H3
47 atoms
Cl -0.349549 -6.53079 0.572495
Cl -2.50954 -6.463931 2.482822
O  0.636659 -0.39181 1.090715
O  1.346807 -1.810176 -0.491648
O  0.773082 4.833712 -0.017511
N  2.316067 1.007055 3.567258
C  -1.690313 -2.480959 -0.781666
C  -1.041048 -3.494821 0.111587
C  -0.86523 -2.012964 0.399108
C  -1.171109 -2.34707 -2.193073
C  -3.177814 -2.237408 -0.680128
C  -1.798126 -4.31455 1.065482
C  0.482659 -1.428534 0.250035
C  -1.574689 -5.596121 1.330585
C  1.906699 0.257814 1.098023
C  1.932878 1.4172 0.133442
C  2.12602 0.679515 2.483181
C  1.32897 2.620578 0.467995
C  2.524547 1.252847 -1.112602
C  1.330235 3.669797 -0.440208
C  2.516417 2.306417 -2.012336
C  1.926912 3.517381 -1.687151
C  0.281387 5.728906 -0.927357
C  0.742276 7.034289 -0.869287
C  -0.693111 5.360406 -1.845763
C  0.21786 7.981448 -1.736624
C  -1.202121 6.313965 -2.712872
C  -0.750127 7.625203 -2.663056
H  -0.163916 -3.969759 -0.312886
H  -1.434569 -1.611588 1.229725
H  -1.309082 -1.328323 -2.559408
H  -1.733193 -3.013251 -2.849234
H  -0.118139 -2.59703 -2.287946
H  -3.546799 -2.239996 0.344774
H  -3.728097 -3.000322 -1.232824
H  -3.429446 -1.267166 -1.110308
H  -2.602823 -3.84501 1.617504
H  2.697056 -0.452206 0.837289
H  0.870592 2.766224 1.438851
H  2.981088 0.309459 -1.379218
H  2.983593 2.189289 -2.980817
H  1.94318 4.335325 -2.39525
H  1.498774 7.302024 -0.143554
H  -1.055138 4.340585 -1.877628
H  0.574487 9.001741 -1.688547
H  -1.96372 6.030196 -3.427026
H  -1.155031 8.365677 -3.339418
totalener: -2050.66175271 hartree
nucrepener: 2643.71882128 hartree
electener: -4694.38057399 hartree
oneelecener: -8062.63954647 hartree
twoeener: 3368.25897248 hartree
kineticenergy: 2044.52994982 hartree
xcener: -151.869956555725 hartree
chargesum: -0.0000000
charge: -0.038825 -0.043162 -0.259028 -0.388927 -0.291481 -0.002050 0.068489 0.038955 -0.099426 -0.247148 -0.242769 -0.201042 0.371772 0.051795 0.324124 -0.007695 -0.260181 -0.186576 -0.128930 0.195791 -0.124918 -0.145455 0.215277 -0.186027 -0.154770 -0.102526 -0.116986 -0.131978 0.087157 0.082750 0.087571 0.089608 0.102526 0.073914 0.099638 0.093701 0.097118 0.121749 0.121907 0.125256 0.130680 0.134845 0.128738 0.132541 0.128312 0.127670 0.128020
qa: -0.0388 -0.0432 -0.2590 -0.3889 -0.2915 -0.0021 0.0685 0.0390 -0.0994 -0.2471 -0.2428 -0.2010 0.3718 0.0518 0.3241 -0.0077 -0.2602 -0.1866 -0.1289 0.1958 -0.1249 -0.1455 0.2153 -0.1860 -0.1548 -0.1025 -0.1170 -0.1320 0.0872 0.0828 0.0876 0.0896 0.1025 0.0739 0.0996 0.0937 0.0971 0.1217 0.1219 0.1253 0.1307 0.1348 0.1287 0.1325 0.1283 0.1277 0.1280
va: 1.2885 1.2619 2.1338 2.1114 2.1124 3.1150 3.7515 3.8343 3.8791 3.9138 3.9113 3.9222 4.2149 4.2523 3.8144 3.7277 4.0275 4.0992 3.9677 3.9134 3.9799 3.9285 3.8233 4.0339 3.9630 3.9375 3.9432 3.9516 1.0492 1.0357 1.0019 1.0012 1.0217 1.0103 1.0024 1.0041 1.0309 1.0196 1.0295 1.0209 1.0012 1.0044 1.0120 1.0031 0.9988 0.9998 0.9998
dispcorr: -0.022522688 hartree
energy: -2050.684275398409
dipole: -4.50712 3.57142 -0.93570 37.49924 -36.69926 0.79997 -24.72239 22.76152 -1.96087
magnitude: 2.31527 au
magnitude: 5.88496 debye
