program: Orca
programVersion: 5.0.2
elementType: Cl Cl O O O N C C C C C C C C C C C C C C C C C C C C C C H H H H H H H H H H H H H H H H H H H
charge: 0
multiplicity: 1
keywords: wb97x-d3
keywords: def2-TZVPP
keywords: def2/J RIJCOSX
keywords: DEFGRID2
keywords: scfconv7
keywords: smallprint printgap noloewdin
keywords: NOSOSCF
formula: C22H19Cl2NO3
InChI: InChI=1/C22H19Cl2NO3/c1-22(2)17(12-19(23)24)20(22)21(26)28-18(13-25)14-7-6-10-16(11-14)27-15-8-4-3-5-9-15/h3-12,17-18,20H,1-2H3
47 atoms
Cl -1.872676 -0.263643 2.506903
Cl -4.493366 -0.529791 1.328657
O  1.731564 -1.508526 -0.445982
O  1.217352 -1.354182 -2.622804
O  0.832412 3.610568 -0.29261
N  4.87345 -2.277384 0.276643
C  -0.547824 -3.570161 -0.302223
C  -0.958303 -2.228096 0.228832
C  -0.355139 -2.340029 -1.162189
C  0.620682 -4.266246 0.353701
C  -1.600089 -4.541821 -0.785093
C  -2.359054 -1.812066 0.356191
C  0.93104 -1.699669 -1.510915
C  -2.835508 -0.986278 1.279859
C  2.939977 -0.776137 -0.633501
C  2.817384 0.55462 0.070097
C  4.023961 -1.613017 -0.118108
C  1.908118 1.464362 -0.460748
C  3.53187 0.865511 1.21561
C  1.695859 2.675667 0.179029
C  3.333035 2.095812 1.82842
C  2.414529 2.997667 1.32578
C  -0.305697 3.220111 -0.947213
C  -0.601777 3.844636 -2.148068
C  -1.170189 2.276795 -0.405277
C  -1.778095 3.526084 -2.810435
C  -2.338681 1.962685 -1.081356
C  -2.647137 2.582961 -2.284082
H  -0.292588 -1.81862 0.97861
H  -1.049526 -2.259335 -1.990833
H  1.336631 -3.583616 0.802574
H  1.154719 -4.887752 -0.366888
H  0.253742 -4.921975 1.144715
H  -2.047191 -5.071203 0.057626
H  -1.14947 -5.285061 -1.443838
H  -2.404994 -4.066333 -1.344554
H  -3.073808 -2.187367 -0.365595
H  3.118238 -0.619289 -1.701875
H  1.370177 1.23168 -1.372305
H  4.241736 0.164809 1.634515
H  3.892008 2.34578 2.71999
H  2.247181 3.950724 1.809742
H  0.082309 4.579221 -2.551867
H  -0.943662 1.80001 0.539998
H  -2.010792 4.016733 -3.746205
H  -3.018877 1.238309 -0.653616
H  -3.563202 2.336978 -2.803688
totalener: -2050.65890453 hartree
nucrepener: 2918.45010709 hartree
electener: -4969.10901162 hartree
oneelecener: -8611.76306994 hartree
twoeener: 3642.65405832 hartree
kineticenergy: 2044.52747893 hartree
xcener: -151.872291803898 hartree
chargesum: 0.0000000
charge: -0.046026 -0.049147 -0.265533 -0.345646 -0.297513 0.001076 0.060490 0.086911 -0.087160 -0.238860 -0.255891 -0.229974 0.347253 0.054237 0.326302 -0.020188 -0.289506 -0.147334 -0.170454 0.192403 -0.081603 -0.199570 0.236823 -0.209546 -0.175805 -0.081515 -0.085757 -0.158067 0.083954 0.084853 0.093878 0.096089 0.089044 0.100501 0.097944 0.074841 0.099778 0.137732 0.148120 0.127116 0.130142 0.128900 0.125732 0.129482 0.126096 0.130645 0.124754
qa: -0.0460 -0.0491 -0.2655 -0.3456 -0.2975 0.0011 0.0605 0.0869 -0.0872 -0.2389 -0.2559 -0.2300 0.3473 0.0542 0.3263 -0.0202 -0.2895 -0.1473 -0.1705 0.1924 -0.0816 -0.1996 0.2368 -0.2095 -0.1758 -0.0815 -0.0858 -0.1581 0.0840 0.0849 0.0939 0.0961 0.0890 0.1005 0.0979 0.0748 0.0998 0.1377 0.1481 0.1271 0.1301 0.1289 0.1257 0.1295 0.1261 0.1306 0.1248
va: 1.2770 1.2502 2.0870 2.1599 2.1169 3.1162 3.7898 3.7267 3.8384 3.9157 3.9180 3.9253 4.2674 4.2091 3.8014 3.8237 4.0398 3.8707 3.9904 3.8831 3.9633 4.0431 3.8655 4.0498 3.9520 3.9253 3.8880 4.0097 1.0486 1.0312 1.0158 1.0027 1.0021 1.0014 1.0034 1.0101 1.0317 1.0256 1.0158 1.0219 0.9996 1.0115 1.0133 1.0184 0.9984 1.0089 1.0014
dispcorr: -0.027952467 hartree
energy: -2050.686856997863
dipole: 7.54546 -8.71121 -1.16575 -10.78895 10.68843 -0.10052 -12.71379 12.65488 -0.05892
magnitude: 1.17156 au
magnitude: 2.97787 debye
