program: Orca
programVersion: 5.0.2
elementType: Cl Cl O O O N C C C C C C C C C C C C C C C C C C C C C C H H H H H H H H H H H H H H H H H H H
charge: 0
multiplicity: 1
keywords: wb97x-d3
keywords: def2-TZVPP
keywords: def2/J RIJCOSX
keywords: DEFGRID2
keywords: scfconv7
keywords: smallprint printgap noloewdin
keywords: NOSOSCF
formula: C22H19Cl2NO3
InChI: InChI=1/C22H19Cl2NO3/c1-22(2)17(12-19(23)24)20(22)21(26)28-18(13-25)14-7-6-10-16(11-14)27-15-8-4-3-5-9-15/h3-12,17-18,20H,1-2H3
47 atoms
Cl -1.658943 -3.652731 -1.938334
Cl -3.102857 -5.870616 -0.781124
O  1.471266 -1.14602 -0.18259
O  -0.440706 0.012967 -0.285393
O  1.528431 4.606657 0.569617
N  4.398554 -1.044351 -1.711098
C  -1.159334 -1.965616 2.077281
C  -1.883849 -2.329357 0.824901
C  -0.389134 -2.133696 0.776314
C  -1.370801 -0.593151 2.668181
C  -0.907919 -3.034257 3.113912
C  -2.454328 -3.678476 0.613838
C  0.159268 -0.970251 0.053475
C  -2.410536 -4.317456 -0.54768
C  2.148737 -0.065699 -0.812505
C  2.39852 1.075404 0.14406
C  3.407131 -0.628138 -1.307915
C  1.833614 2.312452 -0.120232
C  3.16143 0.873641 1.286804
C  2.026727 3.360157 0.772016
C  3.356321 1.928685 2.162958
C  2.788974 3.168204 1.916512
C  0.394568 4.789518 -0.173673
C  0.413189 5.79501 -1.127708
C  -0.755641 4.041849 0.045807
C  -0.731922 6.058731 -1.864015
C  -1.889016 4.308525 -0.705632
C  -1.88438 5.315406 -1.660325
H  -2.448679 -1.521571 0.366007
H  0.220686 -3.027905 0.716745
H  -0.476205 -0.253889 3.192985
H  -2.185522 -0.627327 3.393049
H  -1.624535 0.154836 1.921208
H  -1.764555 -3.131196 3.783739
H  -0.041262 -2.776404 3.723999
H  -0.718482 -4.012414 2.671181
H  -2.961702 -4.167014 1.437297
H  1.578798 0.293255 -1.67577
H  1.233278 2.450362 -1.010098
H  3.607653 -0.091767 1.48836
H  3.95387 1.785983 3.053253
H  2.935362 3.992085 2.602403
H  1.318699 6.366468 -1.283503
H  -0.767705 3.253605 0.78763
H  -0.717035 6.845645 -2.606339
H  -2.782855 3.722434 -0.539307
H  -2.773708 5.518864 -2.240994
totalener: -2050.65954827 hartree
nucrepener: 2779.15372998 hartree
electener: -4829.81327825 hartree
oneelecener: -8333.66276324 hartree
twoeener: 3503.84948499 hartree
kineticenergy: 2044.54405945 hartree
xcener: -151.872368252859 hartree
chargesum: 0.0000000
charge: -0.030513 -0.038242 -0.252814 -0.378043 -0.296068 -0.000561 0.115374 -0.026100 -0.145556 -0.245136 -0.274143 -0.236763 0.367237 0.084966 0.312811 0.015229 -0.255362 -0.134670 -0.204764 0.237861 -0.086602 -0.200634 0.246482 -0.206596 -0.166262 -0.092888 -0.106950 -0.141596 0.111258 0.104001 0.093383 0.089205 0.091021 0.095026 0.096466 0.088762 0.118815 0.116758 0.118002 0.123700 0.128452 0.128813 0.126442 0.130592 0.126529 0.126450 0.126626
qa: -0.0305 -0.0382 -0.2528 -0.3780 -0.2961 -0.0006 0.1154 -0.0261 -0.1456 -0.2451 -0.2741 -0.2368 0.3672 0.0850 0.3128 0.0152 -0.2554 -0.1347 -0.2048 0.2379 -0.0866 -0.2006 0.2465 -0.2066 -0.1663 -0.0929 -0.1070 -0.1416 0.1113 0.1040 0.0934 0.0892 0.0910 0.0950 0.0965 0.0888 0.1188 0.1168 0.1180 0.1237 0.1285 0.1288 0.1264 0.1306 0.1265 0.1265 0.1266
va: 1.3024 1.2682 2.1372 2.1259 2.1204 3.1200 3.7405 3.8501 3.8679 3.9019 3.9142 3.9042 4.1839 4.2108 3.8498 3.6388 4.0179 3.9161 4.0354 3.8722 3.9364 4.0344 3.8013 4.0417 3.9621 3.9304 3.9500 3.9607 1.0247 1.0256 1.0019 1.0041 1.0195 1.0006 1.0062 1.0010 1.0158 1.0193 1.0184 1.0170 0.9992 1.0121 1.0135 1.0014 0.9990 1.0001 1.0002
dispcorr: -0.025093386 hartree
energy: -2050.684641656994
dipole: 2.15289 -3.41380 -1.26091 26.75423 -26.35390 0.40033 22.24072 -20.87822 1.36250
magnitude: 1.89909 au
magnitude: 4.82711 debye
