program: Orca
programVersion: 5.0.2
elementType: Cl Cl O O O N C C C C C C C C C C C C C C C C C C C C C C H H H H H H H H H H H H H H H H H H H
charge: 0
multiplicity: 1
keywords: wb97x-d3
keywords: def2-TZVPP
keywords: def2/J RIJCOSX
keywords: DEFGRID2
keywords: scfconv7
keywords: smallprint printgap noloewdin
keywords: NOSOSCF
formula: C22H19Cl2NO3
InChI: InChI=1/C22H19Cl2NO3/c1-22(2)17(12-19(23)24)20(22)21(26)28-18(13-25)14-7-6-10-16(11-14)27-15-8-4-3-5-9-15/h3-12,17-18,20H,1-2H3
47 atoms
Cl -2.659571 0.515696 -0.85249
Cl -4.536048 -1.17097 -2.254096
O  1.64823 -1.430445 -0.270503
O  2.297564 -3.28243 -1.341258
O  0.764952 3.436185 -0.099962
N  4.236375 -2.151145 1.733841
C  -0.69902 -3.30042 0.589534
C  -1.108739 -2.155313 -0.290464
C  0.017418 -3.071225 -0.727187
C  -0.020686 -2.974482 1.899004
C  -1.559919 -4.538619 0.670262
C  -2.359966 -2.153261 -1.058774
C  1.428143 -2.642106 -0.824922
C  -3.078457 -1.07436 -1.34601
C  2.978368 -0.965973 -0.233129
C  2.984797 0.537187 -0.043037
C  3.686289 -1.634726 0.867977
C  1.819353 1.280646 -0.135662
C  4.20264 1.171411 0.179174
C  1.879173 2.662145 0.017841
C  4.247976 2.547489 0.311758
C  3.086509 3.301524 0.241164
C  -0.36464 3.135486 0.603693
C  -1.565734 3.581225 0.066684
C  -0.344107 2.469636 1.823054
C  -2.74681 3.363478 0.757226
C  -1.537447 2.247965 2.495145
C  -2.741366 2.690894 1.971007
H  -0.802306 -1.182728 0.073506
H  -0.219994 -3.796811 -1.497084
H  0.694912 -3.752002 2.170995
H  -0.766694 -2.919506 2.693085
H  0.507076 -2.024232 1.885642
H  -2.397109 -4.377528 1.351175
H  -0.977778 -5.378818 1.050389
H  -1.969169 -4.841534 -0.292716
H  -2.733594 -3.097213 -1.43546
H  3.498669 -1.220471 -1.163247
H  0.865547 0.808808 -0.329069
H  5.11575 0.593943 0.256088
H  5.195737 3.038743 0.485088
H  3.111002 4.376922 0.354885
H  -1.564838 4.100292 -0.882738
H  0.588704 2.13288 2.255893
H  -3.67949 3.712585 0.334412
H  -1.517883 1.729211 3.4445
H  -3.666874 2.512634 2.500823
totalener: -2050.65754667 hartree
nucrepener: 2903.02837769 hartree
electener: -4953.68592436 hartree
oneelecener: -8581.07337265 hartree
twoeener: 3627.38744829 hartree
kineticenergy: 2044.53487004 hartree
xcener: -151.876520216099 hartree
chargesum: -0.0000000
charge: -0.037726 -0.048890 -0.278735 -0.330359 -0.294627 0.000146 0.069723 0.092771 -0.074602 -0.243731 -0.259264 -0.225630 0.329526 0.066532 0.283836 0.069735 -0.252057 -0.189342 -0.194859 0.230884 -0.095009 -0.189653 0.278459 -0.227255 -0.170094 -0.135966 -0.122060 -0.116352 0.053238 0.082998 0.105810 0.090349 0.081349 0.099735 0.098802 0.074770 0.095550 0.134096 0.125298 0.123208 0.130739 0.129770 0.125048 0.131637 0.128937 0.127828 0.125436
qa: -0.0377 -0.0489 -0.2787 -0.3304 -0.2946 0.0001 0.0697 0.0928 -0.0746 -0.2437 -0.2593 -0.2256 0.3295 0.0665 0.2838 0.0697 -0.2521 -0.1893 -0.1949 0.2309 -0.0950 -0.1897 0.2785 -0.2273 -0.1701 -0.1360 -0.1221 -0.1164 0.0532 0.0830 0.1058 0.0903 0.0813 0.0997 0.0988 0.0748 0.0956 0.1341 0.1253 0.1232 0.1307 0.1298 0.1250 0.1316 0.1289 0.1278 0.1254
va: 1.3149 1.2576 2.0914 2.1715 2.1151 3.1071 3.7694 3.7869 3.8312 3.9089 3.9178 3.9331 4.2809 4.2450 3.8145 3.6991 3.9447 3.9871 4.0350 3.8556 3.9508 4.0438 3.7417 3.9458 3.9109 3.9077 3.9537 3.9145 1.0295 1.0308 1.0023 1.0031 1.0187 1.0008 1.0035 1.0101 1.0321 1.0150 1.0176 1.0135 0.9996 1.0109 1.0169 1.0059 1.0010 0.9998 0.9997
dispcorr: -0.027497410 hartree
energy: -2050.685044081726
dipole: 9.90134 -10.76241 -0.86106 -7.06128 7.49836 0.43708 16.80135 -16.74644 0.05491
magnitude: 0.96720 au
magnitude: 2.45844 debye
