program: Orca
programVersion: 5.0.2
elementType: Cl Cl O O O N C C C C C C C C C C C C C C C C C C C C C C H H H H H H H H H H H H H H H H H H H
charge: 0
multiplicity: 1
keywords: wb97x-d3
keywords: def2-TZVPP
keywords: def2/J RIJCOSX
keywords: DEFGRID2
keywords: scfconv7
keywords: smallprint printgap noloewdin
keywords: NOSOSCF
formula: C22H19Cl2NO3
InChI: InChI=1/C22H19Cl2NO3/c1-22(2)17(12-19(23)24)20(22)21(26)28-18(13-25)14-7-6-10-16(11-14)27-15-8-4-3-5-9-15/h3-12,17-18,20H,1-2H3
47 atoms
Cl -0.081734 -5.127029 1.453198
Cl -2.689606 -6.36324 1.538968
O  1.167236 -0.878393 1.205203
O  1.273931 -1.819064 -0.821402
O  -0.336931 3.517743 -0.588178
N  3.304441 0.680089 3.203386
C  -1.872412 -1.610397 -0.363701
C  -1.391909 -3.025376 -0.413451
C  -0.704838 -2.056363 0.506312
C  -1.641155 -0.717578 -1.558094
C  -3.146417 -1.298402 0.383767
C  -2.197247 -4.135631 0.141088
C  0.665327 -1.612044 0.190218
C  -1.717933 -5.078959 0.940705
C  2.37491 -0.193097 0.923119
C  2.15565 0.966526 -0.023559
C  2.877241 0.283648 2.213693
C  1.031555 1.765441 0.125563
C  3.078266 1.233462 -1.022575
C  0.821439 2.82436 -0.744889
C  2.868058 2.307314 -1.873823
C  1.742418 3.104168 -1.748933
C  -0.392645 4.840363 -0.93247
C  -1.430362 5.25315 -1.752881
C  0.524805 5.756268 -0.434087
C  -1.553228 6.597464 -2.072488
C  0.396468 7.094639 -0.769357
C  -0.639148 7.521045 -1.589083
H  -0.815979 -3.286512 -1.298324
H  -0.925603 -2.126701 1.565351
H  -0.743814 -0.974857 -2.116393
H  -1.556369 0.327415 -1.253623
H  -2.488157 -0.793541 -2.242219
H  -3.288822 -1.940458 1.253198
H  -4.01477 -1.420897 -0.266723
H  -3.140533 -0.264722 0.732256
H  -3.240405 -4.206621 -0.144618
H  3.122011 -0.873959 0.501072
H  0.306517 1.573419 0.906745
H  3.948186 0.601906 -1.14723
H  3.579773 2.517644 -2.660655
H  1.580051 3.926386 -2.433139
H  -2.137923 4.525468 -2.128078
H  1.326777 5.428589 0.215217
H  -2.366313 6.920431 -2.708986
H  1.109142 7.809335 -0.379676
H  -0.735371 8.567659 -1.844134
totalener: -2050.65839476 hartree
nucrepener: 2747.58630227 hartree
electener: -4798.24469704 hartree
oneelecener: -8270.52179282 hartree
twoeener: 3472.27709579 hartree
kineticenergy: 2044.54323234 hartree
xcener: -151.871832539641 hartree
chargesum: -0.0000000
charge: -0.029989 -0.040693 -0.265761 -0.351210 -0.303642 -0.000535 0.116451 0.001985 -0.159310 -0.252262 -0.269625 -0.256871 0.327156 0.094443 0.318826 0.092457 -0.255842 -0.276775 -0.150036 0.234828 -0.105217 -0.154884 0.209958 -0.189390 -0.148233 -0.104185 -0.122639 -0.130159 0.107870 0.109017 0.103270 0.086688 0.092195 0.089372 0.093554 0.097962 0.119119 0.124954 0.127786 0.106710 0.129197 0.135943 0.124756 0.138075 0.126979 0.129867 0.127843
qa: -0.0300 -0.0407 -0.2658 -0.3512 -0.3036 -0.0005 0.1165 0.0020 -0.1593 -0.2523 -0.2696 -0.2569 0.3272 0.0944 0.3188 0.0925 -0.2558 -0.2768 -0.1500 0.2348 -0.1052 -0.1549 0.2100 -0.1894 -0.1482 -0.1042 -0.1226 -0.1302 0.1079 0.1090 0.1033 0.0867 0.0922 0.0894 0.0936 0.0980 0.1191 0.1250 0.1278 0.1067 0.1292 0.1359 0.1248 0.1381 0.1270 0.1299 0.1278
va: 1.3009 1.2648 2.1111 2.1508 2.0784 3.1214 3.7413 3.8327 3.8567 3.8971 3.9087 3.9137 4.2390 4.2071 3.8173 3.6216 4.0245 4.0471 4.0465 3.8092 3.9699 3.9545 3.8378 4.0308 3.9520 3.9436 3.9489 3.9489 1.0267 1.0235 1.0169 1.0047 1.0043 1.0006 1.0017 1.0067 1.0172 1.0173 1.0303 1.0132 1.0009 1.0036 1.0121 1.0025 0.9993 0.9996 0.9997
dispcorr: -0.025360802 hartree
energy: -2050.683755566341
dipole: -5.82153 4.80068 -1.02085 40.12257 -39.24416 0.87840 -18.98889 17.39721 -1.59168
magnitude: 2.08498 au
magnitude: 5.29961 debye
