program: Gaussian 09
title: 000060321
version: EM64L-G09RevD.01
frameworkgroup: C1[X(C8H10N3)]
method: RPBEPBE
basis: SDD
operation: Freq
keyword: #p
keyword: freq=noraman
keyword: PBEPBE/SDD
title: #p freq=noraman PBEPBE/SDD
converged: YES YES NO NO
title: Mulliken charges:
elementType: N N N C C C C C C C C H H H H H H H H H H
charge: -0.099411 -0.029418 0.018864 0.354861 0.053938 -0.303172 -0.615676 -0.257595 -0.574969 -0.165137 -0.185299 0.270641 0.274654 0.275988 0.289157 0.290943 0.274450 0.281539 0.304233 0.268457 0.272953
chargesum: 1.00000
title: Mulliken charges with hydrogens summed into heavy atoms:
elementType: N N N C C C C C C C C
charge: -0.099411 -0.029418 0.018864 0.354861 0.053938 -0.032531 0.224123 0.033348 0.285253 0.103320 0.087654
polarizability: 1.55093871e+02 9.10822524e-01 1.08517310e+02 4.10788324e-02 3.44388288e-01 4.88419404e+01
1716.lowfreq: -13.7524 -9.7114 -0.0007 -0.0007 -0.0002 4.9832 34.6006 117.5619 133.8643
frequency: 31.2230 117.5610 133.8604 152.2139 250.3004 268.8176 285.5264 290.5180 428.3499 482.2026 535.0806 548.5211 558.3330 591.6974 659.6081 700.9968 752.7614 772.8098 840.0454 868.2160 891.0703 972.2373 999.3081 1009.7434 1022.3308 1072.3867 1115.9968 1118.2335 1136.6731 1155.7343 1185.8547 1235.3197 1265.5254 1312.6316 1329.7495 1380.3459 1418.8938 1431.3596 1443.4059 1456.8929 1461.3274 1468.2478 1470.7519 1477.4484 1501.6314 1580.0784 1620.5829 3012.9503 3016.9440 3113.5603 3116.8832 3136.4282 3158.1282 3163.0340 3175.4797 3185.4554 3197.6624
redmass: 1.0332 2.4465 1.9091 1.5364 3.2268 4.4655 2.8236 4.1989 3.0903 6.0293 3.9502 3.7219 5.1897 6.7580 5.7227 5.5110 4.1417 1.3456 4.1262 1.4118 5.5703 1.3483 2.1823 1.3509 2.1970 3.5871 1.3278 1.3170 1.4721 1.9432 1.2068 2.5251 3.0102 1.8317 5.4537 2.5442 1.8740 1.3228 1.7854 1.2026 1.1769 1.5463 1.1421 1.2510 2.6606 6.9235 7.2392 1.0346 1.0343 1.1030 1.1037 1.1017 1.1016 1.0886 1.0913 1.0975 1.1002
irintensity: 0.1309 1.8371 4.0082 4.8220 2.1097 0.7207 1.5130 0.9385 6.7458 1.4429 1.1428 1.5282 2.7504 0.6050 2.5620 2.9476 7.9155 99.5815 18.0545 0.4580 0.3679 1.1754 2.1837 0.0181 13.0258 13.1129 2.1718 1.8489 7.0502 7.2341 6.5862 26.8449 10.1112 12.1872 27.3434 8.4599 7.9263 27.2906 9.1570 14.4798 9.8989 48.8939 15.9113 24.4636 7.7913 31.2043 26.4483 2.9013 1.7123 2.4064 1.0150 0.3593 2.3931 0.7351 1.2490 0.0290 1.0452
temp: 298.150 k
press: 1.00000 atm
elementType: 7 7 7 6 6 6 6 6 6 6 6 1 1 1 1 1 1 1 1 1 1
symmnumber: 1
zpe: 449071.7 jmol-1
zpe.correction: 0.171042 hartree
zpe.thermalcorrener: 0.180842 hartree
zpe.thermalcorrenthalpy: 0.181786 hartree
zpe.thermalcorrgfe: 0.135359 hartree
zpe.sumelectzpe: -474.031882 hartree
zpe.sumelectthermal: -474.022083 hartree
zpe.sumelectthermalent: -474.021139 hartree
zpe.sumelectthermalfe: -474.067566 hartree
dipole: -3.3457 2.6854 0.0053
dipole: 4.2901
quadrupole: -23.6369 -48.4650 -64.4024
quadrupole: -2.3306 0.0486 0.0320
quadrupole: 21.8646 -2.9636 -18.9010 -2.3306 0.0486 0.0320
hfenergy: -474.2029247 hartree
pointgroup: C01 [X(C8H10N3)]
dipole: -1.2934133 1.0843873 0.0019691 debye
dipolederiv: -0.2053462 0.0608142 0.0086911 0.3570634 -0.39943 -0.0201744 -0.0671764 0.042687 -0.0464298 -0.6022857 -0.0607023 -0.0008341 0.0588325 0.6281603 -0.0102656 0.0782467 -0.0092271 -0.0130179 0.3312037 0.297922 -0.0012907 -0.1314763 -0.2810633 0.0028918 -0.0134347 -0.0083992 -0.1112793 0.3840574 -0.1145534 -0.0047711 0.4517254 -0.1310659 0.0040419 -0.0091557 -0.0043029 0.1050124 -0.0823249 -0.1406822 -0.0037959 -0.425137 -0.1493744 0.0023196 0.0096946 0.0072469 0.0696442 -0.3034332 0.156776 0.0017989 -0.0227861 0.1101308 0.0002945 0.0031611 -0.0071272 -0.16081 0.2058989 -0.175734 -0.0143913 -0.230764 0.2742582 0.0389835 0.0227597 0.0008918 0.1805722 0.12329 0.0599284 -0.0010191 -0.0706403 0.1475253 -0.0031907 0.0006585 -0.0033476 -0.0925288 0.4117013 0.0529684 0.0079215 0.085907 0.051818 0.0091172 -0.0473166 0.0067082 0.1554641 0.1008751 -0.0039358 -0.0033509 0.1576576 0.2659271 -0.006694 -0.0073719 -0.0034606 -0.0663204 0.0885896 -0.1729824 0.0003484 -0.297255 -0.1889535 0.0030852 0.0044781 0.0032863 -0.1077131 0.0872549 0.0603941 0.000033 0.0156691 0.0049171 0.0019231 0.0046829 0.0009481 0.1845547 0.0357874 -0.0803815 0.0562161 -0.0115973 0.0623461 0.0149532 0.0338877 0.0200418 0.1357486 0.0271307 0.0270064 -0.068428 -0.0227259 0.0866083 -0.0717949 -0.0660876 -0.0330728 0.0661266 0.0803679 0.0511929 0.0248204 0.0540664 0.0649437 0.03317 0.0434637 -0.0118053 -0.0142583 0.1043334 -0.0173395 0.0011323 0.0146453 0.0487216 0.002483 0.0002076 0.0032962 0.1778447 0.0366789 -0.0204851 -0.0050312 0.0161307 0.0772954 -0.0988321 0.0196481 -0.0747368 0.0402558 0.0195037 -0.0216738 0.0078397 0.004504 0.1147245 0.0754603 -0.0140086 0.0551414 0.0045708 0.111941 0.0568996 -0.0095405 0.0117694 0.0630377 0.0188547 0.0008748 0.0124489 0.1646349 0.0401458 -0.0603697 0.0025259 -0.0478628 0.0609258 0.0023488 0.0017287 0.0027108 0.1600381 0.0046303 0.0449377 0.0011256 0.0322739 0.0885471 0.001025 0.0010592 0.000072 0.1678907 unknown
polarizability: 155.0966023|-0.0937875|108.4967827|-1.2595201|-0.5376352|48.859736 unknown
InChI: InChI=1S/C8H10N3/c1-10-8-6-4-3-5-7(8)9-11(10)2/h3-6H,1-2H3
charge 1 multiplicity 1
21 atoms
N  -1.155764 0.757358 -0.009735
N  -1.730307 -0.519358 0.033705
N  -0.817751 -1.503459 0.041088
C  0.218265 0.5686 -0.017865
C  0.413864 -0.860103 0.00999
C  1.304342 1.473229 -0.04603
C  -1.942297 2.000272 0.012428
C  1.716688 -1.427016 0.005532
C  -3.180236 -0.770092 0.03736
C  2.583665 0.893528 -0.050807
C  2.789507 -0.529597 -0.026018
H  1.174022 2.558304 -0.05981
H  -1.291008 2.817696 -0.331384
H  -2.797632 1.929659 -0.677795
H  -2.29787 2.225303 1.032362
H  1.8579 -2.510301 0.025539
H  -3.66344 -0.224549 0.863725
H  -3.62677 -0.47832 -0.928062
H  -3.30547 -1.851244 0.186226
H  3.460253 1.548555 -0.072642
H  3.81434 -0.911266 -0.031307
