program: Orca
programVersion: 5.0.2
elementType: Cl Cl O O O N C C C C C C C C C C C C C C C C C C C C C C H H H H H H H H H H H H H H H H H H H
charge: 0
multiplicity: 1
keywords: wb97x-d3
keywords: def2-TZVPP
keywords: def2/J RIJCOSX
keywords: DEFGRID2
keywords: scfconv7
keywords: smallprint printgap noloewdin
keywords: NOSOSCF
formula: C22H19Cl2NO3
InChI: InChI=1/C22H19Cl2NO3/c1-22(2)17(12-19(23)24)20(22)21(26)28-18(13-25)14-7-6-10-16(11-14)27-15-8-4-3-5-9-15/h3-12,17-18,20H,1-2H3
47 atoms
Cl -2.697522 -5.031852 -0.420653
Cl -3.81412 -4.93043 2.237736
O  1.545628 -0.400694 0.914368
O  1.013662 -1.482282 -0.980874
O  1.421183 4.422933 -0.392121
N  4.476529 -1.131648 2.323581
C  -1.889346 -0.688264 -0.052415
C  -1.64075 -2.14258 0.214244
C  -0.644935 -1.112875 0.706974
C  -1.79257 -0.206689 -1.478907
C  -2.928932 0.059886 0.748216
C  -2.4218 -2.90102 1.199684
C  0.693748 -1.050876 0.090062
C  -2.908481 -4.122991 1.020806
C  2.874292 -0.201538 0.479169
C  3.157612 1.262095 0.196039
C  3.7571 -0.718677 1.529254
C  2.118876 2.165319 0.04062
C  4.475249 1.680654 0.047932
C  2.405763 3.489613 -0.272925
C  4.745448 3.004972 -0.250675
C  3.71555 3.916744 -0.418979
C  0.265487 4.100824 -1.044748
C  0.276537 3.444493 -2.270058
C  -0.931415 4.503857 -0.471116
C  -0.922821 3.200216 -2.919917
C  -2.124191 4.256472 -1.134665
C  -2.126827 3.603015 -2.358142
H  -1.30842 -2.706966 -0.649508
H  -0.656375 -0.891377 1.768256
H  -1.482052 0.838691 -1.516423
H  -2.775507 -0.273329 -1.948415
H  -1.099367 -0.788784 -2.08067
H  -3.926101 -0.130045 0.348143
H  -2.744458 1.133725 0.689123
H  -2.939304 -0.210898 1.803384
H  -2.624503 -2.438363 2.157636
H  3.063004 -0.783822 -0.430042
H  1.08917 1.861862 0.174079
H  5.292455 0.982379 0.178327
H  5.771044 3.331149 -0.358218
H  3.919065 4.952799 -0.654339
H  1.212172 3.135281 -2.718521
H  -0.920371 5.017367 0.481394
H  -0.913227 2.69351 -3.876001
H  -3.056216 4.577849 -0.688413
H  -3.058782 3.410621 -2.871975
totalener: -2050.66031750 hartree
nucrepener: 2777.03949985 hartree
electener: -4827.69981735 hartree
oneelecener: -8328.87312980 hartree
twoeener: 3501.17331245 hartree
kineticenergy: 2044.51962904 hartree
xcener: -151.871858976909 hartree
chargesum: 0.0000000
charge: -0.038276 -0.042886 -0.278135 -0.362014 -0.297744 -0.002285 0.092196 0.038781 -0.102924 -0.215707 -0.244636 -0.203342 0.326316 0.050419 0.333737 0.037061 -0.248336 -0.140247 -0.201933 0.197678 -0.088851 -0.191295 0.201308 -0.111937 -0.191132 -0.143632 -0.107140 -0.137538 0.088534 0.083635 0.046330 0.092005 0.105332 0.099409 0.092390 0.074501 0.097413 0.132992 0.124694 0.122147 0.130156 0.129750 0.133017 0.130055 0.131857 0.129203 0.129074
qa: -0.0383 -0.0429 -0.2781 -0.3620 -0.2977 -0.0023 0.0922 0.0388 -0.1029 -0.2157 -0.2446 -0.2033 0.3263 0.0504 0.3337 0.0371 -0.2483 -0.1402 -0.2019 0.1977 -0.0889 -0.1913 0.2013 -0.1119 -0.1911 -0.1436 -0.1071 -0.1375 0.0885 0.0836 0.0463 0.0920 0.1053 0.0994 0.0924 0.0745 0.0974 0.1330 0.1247 0.1221 0.1302 0.1297 0.1330 0.1301 0.1319 0.1292 0.1291
va: 1.2894 1.2625 2.1057 2.1442 2.1083 3.1107 3.7264 3.8610 3.8711 3.8974 3.9125 3.9236 4.2427 4.2515 3.7708 3.7357 3.9976 3.9318 4.0494 3.8656 3.9571 4.0363 3.8401 3.8844 4.0121 3.9033 3.9048 3.8789 1.0496 1.0370 1.0197 1.0044 1.0242 1.0027 1.0052 1.0109 1.0301 1.0269 1.0147 1.0159 0.9994 1.0111 1.0040 1.0120 1.0008 0.9979 1.0001
dispcorr: -0.025864311 hartree
energy: -2050.686181808902
dipole: 2.61009 -3.66242 -1.05233 35.56504 -34.12479 1.44024 -12.08586 11.23427 -0.85159
magnitude: 1.97659 au
magnitude: 5.02410 debye
