program: Orca
programVersion: 5.0.2
elementType: Cl Cl O O O N C C C C C C C C C C C C C C C C C C C C C C H H H H H H H H H H H H H H H H H H H
charge: 0
multiplicity: 1
keywords: wb97x-d3
keywords: def2-TZVPP
keywords: def2/J RIJCOSX
keywords: DEFGRID2
keywords: scfconv7
keywords: smallprint printgap noloewdin
keywords: NOSOSCF
formula: C22H19Cl2NO3
InChI: InChI=1/C22H19Cl2NO3/c1-22(2)17(12-19(23)24)20(22)21(26)28-18(13-25)14-7-6-10-16(11-14)27-15-8-4-3-5-9-15/h3-12,17-18,20H,1-2H3
47 atoms
Cl -2.668399 -5.04622 -0.699604
Cl -4.272758 -4.675452 1.671216
O  1.400082 -0.247759 1.334915
O  1.498308 -1.656036 -0.403457
O  1.687953 4.311391 -0.908831
N  3.632867 0.765877 3.555525
C  -1.555696 -0.917052 -0.564873
C  -1.405351 -2.281071 0.044685
C  -0.611596 -1.123804 0.604868
C  -1.014382 -0.707195 -1.957752
C  -2.790766 -0.098918 -0.273887
C  -2.460726 -2.879601 0.876586
C  0.85174 -1.076065 0.422278
C  -3.050623 -4.044716 0.641509
C  2.784151 0.019006 1.199415
C  3.05868 1.108223 0.186049
C  3.241982 0.437948 2.526655
C  2.19293 2.187253 0.080795
C  4.206629 1.050926 -0.590614
C  2.487434 3.212072 -0.807722
C  4.496816 2.088654 -1.462564
C  3.63987 3.170781 -1.579361
C  0.342495 4.135636 -1.069892
C  -0.167683 3.229106 -1.991219
C  -0.507995 4.93387 -0.319527
C  -1.540347 3.132996 -2.159565
C  -1.878994 4.827839 -0.499098
C  -2.401351 3.926596 -1.414987
H  -0.829796 -2.979937 -0.552546
H  -0.954778 -0.707813 1.545752
H  -0.671278 0.320477 -2.085697
H  -1.808133 -0.887205 -2.684625
H  -0.188154 -1.370393 -2.199769
H  -3.60358 -0.385853 -0.943052
H  -2.584496 0.961401 -0.42771
H  -3.150541 -0.217233 0.747442
H  -2.793256 -2.337321 1.753225
H  3.331365 -0.887758 0.920744
H  1.300871 2.243243 0.692534
H  4.87421 0.202068 -0.515563
H  5.392463 2.048851 -2.067457
H  3.8570 3.982773 -2.260501
H  0.500561 2.6157 -2.582791
H  -0.092504 5.634457 0.392642
H  -1.937916 2.435966 -2.885871
H  -2.541442 5.452011 0.085835
H  -3.471017 3.848079 -1.554437
totalener: -2050.65994283 hartree
nucrepener: 2792.23233309 hartree
electener: -4842.89227593 hartree
oneelecener: -8359.29890456 hartree
twoeener: 3516.40662864 hartree
kineticenergy: 2044.53690527 hartree
xcener: -151.871938754343 hartree
chargesum: 0.0000000
charge: -0.038711 -0.041689 -0.275976 -0.362547 -0.300754 0.002424 0.110361 0.023530 -0.100762 -0.252002 -0.240345 -0.193872 0.322823 0.040276 0.308337 0.063626 -0.256833 -0.118888 -0.162639 0.147486 -0.092670 -0.180713 0.190468 -0.101503 -0.182513 -0.198845 -0.095986 -0.126315 0.092664 0.082226 0.060951 0.095193 0.108623 0.097416 0.096174 0.073611 0.102370 0.128232 0.131094 0.109818 0.129405 0.132548 0.139400 0.131439 0.142497 0.128092 0.132478
qa: -0.0387 -0.0417 -0.2760 -0.3625 -0.3008 0.0024 0.1104 0.0235 -0.1008 -0.2520 -0.2403 -0.1939 0.3228 0.0403 0.3083 0.0636 -0.2568 -0.1189 -0.1626 0.1475 -0.0927 -0.1807 0.1905 -0.1015 -0.1825 -0.1988 -0.0960 -0.1263 0.0927 0.0822 0.0610 0.0952 0.1086 0.0974 0.0962 0.0736 0.1024 0.1282 0.1311 0.1098 0.1294 0.1325 0.1394 0.1314 0.1425 0.1281 0.1325
va: 1.2889 1.2645 2.1083 2.1422 2.0998 3.1208 3.6967 3.8601 3.8875 3.9065 3.9096 3.8955 4.2632 4.2454 3.8265 3.6692 4.0200 3.9189 4.0411 3.8970 3.9505 4.0358 3.8598 3.8533 4.0182 3.9200 3.9502 3.9014 1.0438 1.0386 1.0186 1.0019 1.0262 1.0037 1.0075 1.0121 1.0253 1.0229 1.0234 1.0117 0.9994 1.0094 0.9996 1.0116 0.9930 0.9979 0.9982
dispcorr: -0.026496682 hartree
energy: -2050.686439513482
dipole: 5.53876 -6.30709 -0.76833 31.20578 -30.60693 0.59885 -13.99802 12.72528 -1.27274
magnitude: 1.60275 au
magnitude: 4.07388 debye
