program: Orca
programVersion: 5.0.2
elementType: Cl Cl O O O N C C C C C C C C C C C C C C C C C C C C C C H H H H H H H H H H H H H H H H H H H
charge: 0
multiplicity: 1
keywords: wb97x-d3
keywords: def2-TZVPP
keywords: def2/J RIJCOSX
keywords: DEFGRID2
keywords: scfconv7
keywords: smallprint printgap noloewdin
keywords: NOSOSCF
formula: C22H19Cl2NO3
InChI: InChI=1/C22H19Cl2NO3/c1-22(2)17(12-19(23)24)20(22)21(26)28-18(13-25)14-7-6-10-16(11-14)27-15-8-4-3-5-9-15/h3-12,17-18,20H,1-2H3
47 atoms
Cl -1.093964 -3.982289 2.494402
Cl -3.488653 -5.473426 1.879468
O  0.524489 -0.335643 0.901395
O  1.635105 -1.994752 -0.108214
O  1.381108 3.795028 -2.203039
N  1.31287 1.837868 3.268772
C  -1.153706 -2.33533 -1.549669
C  -0.932711 -3.410004 -0.537925
C  -0.759725 -1.969486 -0.126211
C  -0.169812 -2.185743 -2.683968
C  -2.570096 -1.978859 -1.932289
C  -2.053101 -4.209112 0.005941
C  0.594489 -1.47985 0.195522
C  -2.19274 -4.513141 1.289544
C  1.764646 0.280092 1.219787
C  2.320302 1.066359 0.056803
C  1.492321 1.150404 2.36636
C  1.554947 2.081779 -0.506402
C  3.574214 0.763254 -0.446347
C  2.067658 2.809636 -1.570439
C  4.073561 1.495147 -1.514564
C  3.331993 2.518097 -2.07427
C  0.393263 4.486536 -1.556317
C  -0.818264 4.634708 -2.212953
C  0.604304 5.076726 -0.316679
C  -1.826912 5.382451 -1.623884
C  -0.416573 5.810732 0.266304
C  -1.633016 5.968554 -0.382492
H  0.002744 -3.955257 -0.639829
H  -1.550633 -1.529517 0.470229
H  0.836771 -2.499371 -2.418095
H  -0.1201 -1.148852 -3.021029
H  -0.493961 -2.792798 -3.531234
H  -2.929925 -2.632568 -2.729543
H  -2.618206 -0.953436 -2.301009
H  -3.26478 -2.061558 -1.095765
H  -2.790554 -4.602671 -0.683948
H  2.496589 -0.469867 1.537059
H  0.570316 2.302311 -0.11193
H  4.154048 -0.04288 -0.017426
H  5.052257 1.2665 -1.914173
H  3.718157 3.095073 -2.904117
H  -0.961494 4.171968 -3.180599
H  1.553625 4.964972 0.191535
H  -2.771007 5.500716 -2.138887
H  -0.254306 6.266663 1.233834
H  -2.423311 6.546348 0.077036
totalener: -2050.66005885 hartree
nucrepener: 2765.12360696 hartree
electener: -4815.78366580 hartree
oneelecener: -8305.77194584 hartree
twoeener: 3489.98828004 hartree
kineticenergy: 2044.53137245 hartree
xcener: -151.869663218933 hartree
chargesum: -0.0000000
charge: -0.030276 -0.039609 -0.264468 -0.371346 -0.295923 -0.003232 0.110457 -0.015887 -0.154680 -0.246971 -0.271014 -0.244183 0.362808 0.090085 0.331004 0.025074 -0.260669 -0.213721 -0.141997 0.242999 -0.084753 -0.211276 0.256521 -0.210662 -0.182406 -0.091962 -0.101701 -0.142581 0.109612 0.106880 0.101318 0.090709 0.087303 0.093998 0.096397 0.089049 0.118541 0.119661 0.132521 0.111254 0.128011 0.129402 0.124212 0.136853 0.125774 0.131491 0.127382
qa: -0.0303 -0.0396 -0.2645 -0.3713 -0.2959 -0.0032 0.1105 -0.0159 -0.1547 -0.2470 -0.2710 -0.2442 0.3628 0.0901 0.3310 0.0251 -0.2607 -0.2137 -0.1420 0.2430 -0.0848 -0.2113 0.2565 -0.2107 -0.1824 -0.0920 -0.1017 -0.1426 0.1096 0.1069 0.1013 0.0907 0.0873 0.0940 0.0964 0.0890 0.1185 0.1197 0.1325 0.1113 0.1280 0.1294 0.1242 0.1369 0.1258 0.1315 0.1274
va: 1.3022 1.2665 2.1277 2.1341 2.1189 3.1207 3.7404 3.8421 3.8750 3.9008 3.9140 3.9078 4.1897 4.2080 3.8363 3.6663 4.0266 3.9608 4.0103 3.8365 3.9526 4.0366 3.7832 4.0472 3.9685 3.9299 3.9431 3.9620 1.0262 1.0245 1.0197 1.0022 1.0026 1.0010 1.0065 1.0009 1.0167 1.0199 1.0206 1.0167 0.9997 1.0121 1.0136 1.0026 0.9990 0.9991 1.0001
dispcorr: -0.024503656 hartree
energy: -2050.684562502108
dipole: 4.60849 -4.97275 -0.36425 24.06264 -24.22172 -0.15908 -27.29635 25.68028 -1.61606
magnitude: 1.66422 au
magnitude: 4.23012 debye
