program: Orca
programVersion: 5.0.2
elementType: Cl Cl O O O N C C C C C C C C C C C C C C C C C C C C C C H H H H H H H H H H H H H H H H H H H
charge: 0
multiplicity: 1
keywords: wb97x-d3
keywords: def2-TZVPP
keywords: def2/J RIJCOSX
keywords: DEFGRID2
keywords: scfconv7
keywords: smallprint printgap noloewdin
keywords: NOSOSCF
formula: C22H19Cl2NO3
InChI: InChI=1/C22H19Cl2NO3/c1-22(2)17(12-19(23)24)20(22)21(26)28-18(13-25)14-7-6-10-16(11-14)27-15-8-4-3-5-9-15/h3-12,17-18,20H,1-2H3
47 atoms
Cl -3.104836 -3.831293 -0.47352
Cl -3.115536 -6.613286 0.292266
O  -0.119743 -0.898962 -0.907373
O  -0.73603 -0.56537 1.217129
O  2.30456 4.303137 0.771696
N  -0.549211 0.871133 -3.680334
C  0.681183 -3.349809 1.593464
C  -0.802425 -3.516786 1.602552
C  -0.158245 -2.766177 0.465639
C  1.322804 -2.452771 2.622703
C  1.540995 -4.529116 1.204675
C  -1.429943 -4.835302 1.364583
C  -0.381248 -1.312694 0.349248
C  -2.41691 -5.058855 0.507063
C  -0.151461 0.500053 -1.124634
C  1.141476 1.166767 -0.709704
C  -0.375832 0.683521 -2.560678
C  1.097682 2.427121 -0.136788
C  2.358193 0.536259 -0.937598
C  2.283892 3.075321 0.189068
C  3.531073 1.179583 -0.578731
C  3.502928 2.44973 -0.02526
C  1.43749 5.274964 0.356672
C  1.092744 5.444046 -0.978927
C  0.949146 6.139441 1.325462
C  0.242714 6.479991 -1.333534
C  0.110045 7.178194 0.953703
C  -0.251783 7.350993 -0.373979
H  -1.332891 -2.884273 2.310613
H  -0.076947 -3.285255 -0.482129
H  2.238764 -2.005577 2.232614
H  1.592008 -3.041195 3.501489
H  0.672341 -1.646419 2.951805
H  1.749299 -5.155533 2.074236
H  2.498593 -4.189538 0.807787
H  1.072402 -5.157811 0.44721
H  -1.08101 -5.677904 1.950626
H  -0.991003 0.958839 -0.591634
H  0.144619 2.904632 0.056822
H  2.394777 -0.44369 -1.39396
H  4.48315 0.694895 -0.748089
H  4.418239 2.960509 0.242576
H  1.48259 4.780059 -1.739706
H  1.231949 5.996331 2.360035
H  -0.026445 6.608204 -2.373564
H  -0.267923 7.851694 1.7114
H  -0.912167 8.158365 -0.659247
totalener: -2050.65900172 hartree
nucrepener: 2717.74847190 hartree
electener: -4768.40747362 hartree
oneelecener: -8210.82989291 hartree
twoeener: 3442.42241929 hartree
kineticenergy: 2044.53706621 hartree
xcener: -151.871242212893 hartree
chargesum: 0.0000000
charge: -0.027995 -0.039370 -0.268550 -0.366255 -0.297740 -0.000096 0.113061 -0.003833 -0.167297 -0.244705 -0.267535 -0.251705 0.348637 0.093377 0.310305 0.077589 -0.253281 -0.172168 -0.199587 0.214407 -0.096504 -0.185104 0.251343 -0.171933 -0.216976 -0.113800 -0.086186 -0.147873 0.107559 0.110097 0.087501 0.087370 0.103664 0.093713 0.094594 0.090599 0.118781 0.123885 0.118464 0.127175 0.128851 0.130329 0.136881 0.126076 0.131150 0.126280 0.126806
qa: -0.0280 -0.0394 -0.2686 -0.3663 -0.2977 -0.0001 0.1131 -0.0038 -0.1673 -0.2447 -0.2675 -0.2517 0.3486 0.0934 0.3103 0.0776 -0.2533 -0.1722 -0.1996 0.2144 -0.0965 -0.1851 0.2513 -0.1719 -0.2170 -0.1138 -0.0862 -0.1479 0.1076 0.1101 0.0875 0.0874 0.1037 0.0937 0.0946 0.0906 0.1188 0.1239 0.1185 0.1272 0.1289 0.1303 0.1369 0.1261 0.1312 0.1263 0.1268
va: 1.3034 1.2657 2.1087 2.1374 2.1134 3.1223 3.7331 3.8405 3.8762 3.9007 3.9133 3.9094 4.1990 4.2075 3.8266 3.6488 4.0189 4.0008 4.0087 3.8727 3.9429 4.0349 3.7943 3.9355 4.0420 3.9502 3.9313 3.9660 1.0268 1.0237 1.0033 1.0030 1.0200 1.0021 1.0066 1.0000 1.0177 1.0250 1.0130 1.0193 0.9995 1.0107 1.0032 1.0139 0.9991 0.9986 1.0002
dispcorr: -0.024272093 hartree
energy: -2050.683273817440
dipole: 26.52127 -25.51693 1.00433 22.49856 -22.82728 -0.32872 11.47936 -10.21364 1.26572
magnitude: 1.64888 au
magnitude: 4.19111 debye
