program: Orca
programVersion: 5.0.2
elementType: Cl Cl O O O N C C C C C C C C C C C C C C C C C C C C C C H H H H H H H H H H H H H H H H H H H
charge: 0
multiplicity: 1
keywords: wb97x-d3
keywords: def2-TZVPP
keywords: def2/J RIJCOSX
keywords: DEFGRID2
keywords: scfconv7
keywords: smallprint printgap noloewdin
keywords: NOSOSCF
formula: C22H19Cl2NO3
InChI: InChI=1/C22H19Cl2NO3/c1-22(2)17(12-19(23)24)20(22)21(26)28-18(13-25)14-7-6-10-16(11-14)27-15-8-4-3-5-9-15/h3-12,17-18,20H,1-2H3
47 atoms
Cl -3.813376 -3.278013 -1.473881
Cl -3.451731 -5.757617 -0.048342
O  1.914301 -1.082846 0.13024
O  0.130735 -0.155794 -0.855059
O  1.739666 4.528095 0.009512
N  5.002944 -1.552212 -0.932786
C  -1.314178 -1.333757 1.673876
C  -1.598396 -2.166232 0.458773
C  -0.164944 -1.836776 0.821342
C  -1.717347 0.120469 1.640396
C  -1.434857 -1.946243 3.049419
C  -2.056471 -3.55827 0.546987
C  0.594675 -0.930975 -0.064008
C  -2.982785 -4.113717 -0.224915
C  2.776239 -0.224704 -0.616116
C  2.983766 1.08591 0.1024
C  4.0231 -0.972891 -0.783183
C  2.260244 2.196664 -0.310264
C  3.843112 1.169064 1.190912
C  2.393447 3.3958 0.379221
C  3.978498 2.374588 1.859313
C  3.253866 3.487312 1.464719
C  0.486863 4.445675 -0.534747
C  0.227184 5.201735 -1.666983
C  -0.513867 3.679526 0.049326
C  -1.046714 5.193699 -2.215312
C  -1.77934 3.672784 -0.514733
C  -2.052849 4.428403 -1.645954
H  -1.977629 -1.606501 -0.388416
H  0.426356 -2.628968 1.266609
H  -2.733827 0.224321 2.023489
H  -1.693733 0.545835 0.639936
H  -1.061838 0.71679 2.27859
H  -2.476864 -1.957288 3.372721
H  -0.866913 -1.361182 3.773861
H  -1.062618 -2.968621 3.099805
H  -1.60742 -4.199874 1.294793
H  2.362423 -0.042074 -1.612395
H  1.589655 2.122077 -1.156582
H  4.414395 0.306389 1.50906
H  4.651657 2.449661 2.702562
H  3.35399 4.42957 1.987058
H  1.018704 5.793592 -2.107341
H  -0.309637 3.092778 0.935786
H  -1.248756 5.785287 -3.09828
H  -2.558294 3.074358 -0.060671
H  -3.043276 4.420573 -2.080039
totalener: -2050.66149469 hartree
nucrepener: 2766.66661835 hartree
electener: -4817.32811305 hartree
oneelecener: -8308.39271596 hartree
twoeener: 3491.06460291 hartree
kineticenergy: 2044.53680944 hartree
xcener: -151.871946441989 hartree
chargesum: 0.0000000
charge: -0.038454 -0.042925 -0.254318 -0.383438 -0.297581 -0.001351 0.081485 0.045875 -0.100151 -0.267236 -0.245081 -0.208417 0.369660 0.053506 0.311581 -0.006889 -0.258071 -0.131375 -0.173801 0.211775 -0.096055 -0.194581 0.228450 -0.201950 -0.146097 -0.095867 -0.101900 -0.142386 0.089144 0.084145 0.095932 0.087975 0.091963 0.100280 0.095149 0.075055 0.097810 0.123159 0.133632 0.121749 0.130060 0.129831 0.126569 0.126549 0.126625 0.123902 0.126061
qa: -0.0385 -0.0429 -0.2543 -0.3834 -0.2976 -0.0014 0.0815 0.0459 -0.1002 -0.2672 -0.2451 -0.2084 0.3697 0.0535 0.3116 -0.0069 -0.2581 -0.1314 -0.1738 0.2118 -0.0961 -0.1946 0.2285 -0.2020 -0.1461 -0.0959 -0.1019 -0.1424 0.0891 0.0841 0.0959 0.0880 0.0920 0.1003 0.0951 0.0751 0.0978 0.1232 0.1336 0.1217 0.1301 0.1298 0.1266 0.1265 0.1266 0.1239 0.1261
va: 1.2890 1.2624 2.1362 2.1132 2.1156 3.1164 3.7479 3.8223 3.8854 3.9240 3.9100 3.9266 4.2242 4.2532 3.8314 3.6872 4.0219 3.8905 4.0411 3.8784 3.9475 4.0403 3.8442 4.0340 3.9459 3.9391 3.9476 3.9859 1.0491 1.0348 1.0038 1.0177 0.9987 1.0024 1.0041 1.0103 1.0309 1.0181 1.0218 1.0162 0.9995 1.0115 1.0130 1.0003 0.9986 0.9999 1.0005
dispcorr: -0.025090817 hartree
energy: -2050.686585510427
dipole: 7.46911 -8.43190 -0.96278 28.89061 -28.09228 0.79834 15.81100 -14.67820 1.13280
magnitude: 1.68746 au
magnitude: 4.28918 debye
