program: Orca
programVersion: 5.0.2
elementType: Cl Cl O O O N C C C C C C C C C C C C C C C C C C C C C C H H H H H H H H H H H H H H H H H H H
charge: 0
multiplicity: 1
keywords: wb97x-d3
keywords: def2-TZVPP
keywords: def2/J RIJCOSX
keywords: DEFGRID2
keywords: scfconv7
keywords: smallprint printgap noloewdin
keywords: NOSOSCF
formula: C22H19Cl2NO3
InChI: InChI=1/C22H19Cl2NO3/c1-22(2)17(12-19(23)24)20(22)21(26)28-18(13-25)14-7-6-10-16(11-14)27-15-8-4-3-5-9-15/h3-12,17-18,20H,1-2H3
47 atoms
Cl -1.100652 -4.137282 -1.67443
Cl -1.799752 -6.758195 -0.687465
O  0.749027 -0.947781 -0.229349
O  -1.307595 -0.286853 0.351322
O  0.854954 4.807666 0.99818
N  2.596424 -0.181787 -2.876895
C  -1.158471 -2.641231 2.402393
C  -1.825677 -3.123565 1.159922
C  -0.488012 -2.425789 1.055058
C  -1.772132 -1.491426 3.161562
C  -0.479207 -3.65288 3.295086
C  -1.92945 -4.563744 0.837228
C  -0.436688 -1.111433 0.387973
C  -1.646648 -5.081424 -0.350848
C  0.946095 0.283851 -0.905054
C  1.501186 1.343152 0.015844
C  1.877686 0.002325 -2.0001
C  0.888735 2.584235 0.067651
C  2.619558 1.0721 0.794888
C  1.417376 3.576284 0.886225
C  3.117576 2.058384 1.628806
C  2.528987 3.312732 1.672892
C  0.269899 5.398798 -0.086965
C  0.867397 5.391565 -1.341524
C  -0.92807 6.065293 0.120091
C  0.246875 6.049458 -2.391795
C  -1.530929 6.729813 -0.937068
C  -0.951494 6.720786 -2.19678
H  -2.667315 -2.521936 0.824354
H  0.369229 -3.059603 0.861282
H  -2.297544 -0.789417 2.520068
H  -1.008539 -0.937728 3.710129
H  -2.486383 -1.878314 3.890687
H  -1.195276 -4.091835 3.992608
H  0.304014 -3.175285 3.885084
H  -0.020442 -4.467236 2.73374
H  -2.283333 -5.240832 1.606013
H  0.00895 0.635405 -1.348339
H  0.001675 2.776179 -0.523331
H  3.099841 0.103368 0.749805
H  3.985853 1.857402 2.241715
H  2.924041 4.090158 2.313285
H  1.809624 4.882475 -1.499637
H  -1.37763 6.062969 1.104231
H  0.712299 6.041785 -3.368463
H  -2.464628 7.251205 -0.773269
H  -1.427792 7.234966 -3.020343
totalener: -2050.65942424 hartree
nucrepener: 2724.87604697 hartree
electener: -4775.53547121 hartree
oneelecener: -8225.21106807 hartree
twoeener: 3449.67559686 hartree
kineticenergy: 2044.54705892 hartree
xcener: -151.872848598327 hartree
chargesum: 0.0000000
charge: -0.026708 -0.038900 -0.264944 -0.378328 -0.297351 -0.000643 0.117136 -0.019468 -0.165021 -0.248619 -0.268192 -0.244499 0.367279 0.091833 0.312591 0.035615 -0.251530 -0.139666 -0.193906 0.215505 -0.092521 -0.191235 0.243489 -0.170946 -0.208359 -0.112458 -0.089197 -0.144178 0.109548 0.108677 0.104782 0.089207 0.085406 0.093766 0.096047 0.088931 0.118851 0.118002 0.120305 0.124741 0.128896 0.129481 0.137342 0.125947 0.130393 0.126453 0.126443
qa: -0.0267 -0.0389 -0.2649 -0.3783 -0.2974 -0.0006 0.1171 -0.0195 -0.1650 -0.2486 -0.2682 -0.2445 0.3673 0.0918 0.3126 0.0356 -0.2515 -0.1397 -0.1939 0.2155 -0.0925 -0.1912 0.2435 -0.1709 -0.2084 -0.1125 -0.0892 -0.1442 0.1095 0.1087 0.1048 0.0892 0.0854 0.0938 0.0960 0.0889 0.1189 0.1180 0.1203 0.1247 0.1289 0.1295 0.1373 0.1259 0.1304 0.1265 0.1264
va: 1.3076 1.2667 2.1193 2.1249 2.1145 3.1207 3.7219 3.8517 3.8931 3.9001 3.9170 3.9070 4.1696 4.2065 3.8411 3.6626 4.0224 3.9463 4.0295 3.8713 3.9423 4.0336 3.8033 3.9467 4.0437 3.9462 3.9318 3.9635 1.0249 1.0239 1.0210 1.0021 1.0020 1.0016 1.0066 1.0003 1.0173 1.0270 1.0153 1.0177 0.9993 1.0113 1.0023 1.0136 0.9993 0.9988 1.0003
dispcorr: -0.023916224 hartree
energy: -2050.683340466713
dipole: 1.17226 -1.76342 -0.59116 28.48175 -28.24882 0.23293 21.79159 -20.20162 1.58997
magnitude: 1.71223 au
magnitude: 4.35214 debye
