program: Orca
programVersion: 5.0.2
elementType: Cl Cl O O O N C C C C C C C C C C C C C C C C C C C C C C H H H H H H H H H H H H H H H H H H H
charge: 0
multiplicity: 1
keywords: wb97x-d3
keywords: def2-TZVPP
keywords: def2/J RIJCOSX
keywords: DEFGRID2
keywords: scfconv7
keywords: smallprint printgap noloewdin
keywords: NOSOSCF
formula: C22H19Cl2NO3
InChI: InChI=1/C22H19Cl2NO3/c1-22(2)17(12-19(23)24)20(22)21(26)28-18(13-25)14-7-6-10-16(11-14)27-15-8-4-3-5-9-15/h3-12,17-18,20H,1-2H3
47 atoms
Cl -0.559369 -4.411787 -1.262238
Cl -1.800693 -6.704813 -0.025082
O  1.043752 -0.964996 0.070711
O  -1.021693 -0.192539 -0.317337
O  0.60541 4.66799 0.720234
N  3.741085 -0.890477 -1.842164
C  -1.793375 -1.982406 2.128822
C  -2.054828 -2.734028 0.867811
C  -0.696217 -2.10749 1.083526
C  -2.507698 -0.673675 2.361035
C  -1.551552 -2.764536 3.398547
C  -2.191656 -4.207147 0.851561
C  -0.293249 -0.985481 0.214845
C  -1.594933 -5.000232 -0.028401
C  1.588028 0.081177 -0.725991
C  1.895568 1.297775 0.111957
C  2.795704 -0.473411 -1.340911
C  1.104413 2.42907 -0.019447
C  2.930748 1.264363 1.039122
C  1.366956 3.54319 0.770364
C  3.173015 2.375357 1.828093
C  2.40079 3.518522 1.69454
C  0.115101 5.109381 -0.477335
C  0.911953 5.185764 -1.61304
C  -1.202477 5.539326 -0.508833
C  0.374115 5.694136 -2.784941
C  -1.724072 6.055221 -1.685303
C  -0.942128 6.130993 -2.828045
H  -2.67236 -2.213017 0.139807
H  0.11013 -2.783101 1.343373
H  -2.729893 -0.13961 1.441322
H  -1.913692 -0.015054 2.996617
H  -3.45191 -0.862725 2.874481
H  -2.497669 -3.011495 3.884189
H  -0.964192 -2.174564 4.103221
H  -1.015487 -3.697212 3.221293
H  -2.840766 -4.672975 1.583909
H  0.897132 0.348701 -1.531052
H  0.281323 2.436974 -0.723126
H  3.551493 0.382976 1.137516
H  3.980903 2.359709 2.547067
H  2.592646 4.393047 2.302023
H  1.943853 4.859402 -1.583358
H  -1.807045 5.47274 0.386043
H  0.994813 5.755316 -3.669098
H  -2.751703 6.393011 -1.707271
H  -1.353996 6.529553 -3.745123
totalener: -2050.66000956 hartree
nucrepener: 2738.91648696 hartree
electener: -4789.57649652 hartree
oneelecener: -8253.32285333 hartree
twoeener: 3463.74635680 hartree
kineticenergy: 2044.53891466 hartree
xcener: -151.870847993903 hartree
chargesum: -0.0000000
charge: -0.027267 -0.039112 -0.254688 -0.387701 -0.298352 -0.002582 0.112274 -0.019102 -0.166418 -0.249845 -0.267878 -0.245300 0.388597 0.092106 0.318241 -0.006321 -0.257070 -0.107302 -0.176896 0.196307 -0.099027 -0.190167 0.229091 -0.155240 -0.201655 -0.116209 -0.091868 -0.140393 0.109477 0.107524 0.103435 0.089805 0.086228 0.093592 0.096493 0.088881 0.118932 0.117373 0.129098 0.122373 0.129974 0.129928 0.133733 0.125359 0.129087 0.126170 0.126317
qa: -0.0273 -0.0391 -0.2547 -0.3877 -0.2984 -0.0026 0.1123 -0.0191 -0.1664 -0.2498 -0.2679 -0.2453 0.3886 0.0921 0.3182 -0.0063 -0.2571 -0.1073 -0.1769 0.1963 -0.0990 -0.1902 0.2291 -0.1552 -0.2017 -0.1162 -0.0919 -0.1404 0.1095 0.1075 0.1034 0.0898 0.0862 0.0936 0.0965 0.0889 0.1189 0.1174 0.1291 0.1224 0.1300 0.1299 0.1337 0.1254 0.1291 0.1262 0.1263
va: 1.3064 1.2666 2.1301 2.1121 2.1088 3.1184 3.7264 3.8442 3.8962 3.9009 3.9156 3.9055 4.1533 4.2066 3.8370 3.6745 4.0227 3.8866 4.0412 3.8798 3.9469 4.0393 3.8185 3.9440 4.0412 3.9508 3.9365 3.9621 1.0249 1.0245 1.0207 1.0020 1.0022 1.0015 1.0064 1.0005 1.0172 1.0234 1.0219 1.0153 0.9996 1.0112 1.0038 1.0136 0.9996 0.9989 1.0002
dispcorr: -0.024014065 hartree
energy: -2050.684023621329
dipole: -5.64517 4.53487 -1.11030 33.24408 -32.56016 0.68392 15.67647 -14.45851 1.21796
magnitude: 1.78436 au
magnitude: 4.53549 debye
