program: Orca
programVersion: 5.0.2
elementType: Cl Cl O O O N C C C C C C C C C C C C C C C C C C C C C C H H H H H H H H H H H H H H H H H H H
charge: 0
multiplicity: 1
keywords: wb97x-d3
keywords: def2-TZVPP
keywords: def2/J RIJCOSX
keywords: DEFGRID2
keywords: scfconv7
keywords: smallprint printgap noloewdin
keywords: NOSOSCF
formula: C22H19Cl2NO3
InChI: InChI=1/C22H19Cl2NO3/c1-22(2)17(12-19(23)24)20(22)21(26)28-18(13-25)14-7-6-10-16(11-14)27-15-8-4-3-5-9-15/h3-12,17-18,20H,1-2H3
47 atoms
Cl -2.250844 -1.367839 1.565582
Cl -4.813514 -2.471914 0.824659
O  1.28979 -0.898351 -0.258503
O  1.693555 -2.821693 0.807585
O  1.407805 4.116768 -1.53133
N  1.650718 0.369429 2.843724
C  -0.318212 -4.015131 -1.286284
C  -1.024665 -3.72132 -0.007084
C  -0.193791 -2.637164 -0.656173
C  0.839169 -4.982502 -1.273854
C  -1.122725 -4.060741 -2.564171
C  -2.494673 -3.574123 0.068644
C  1.019055 -2.181809 0.048959
C  -3.103331 -2.600653 0.733383
C  2.380302 -0.293679 0.419063
C  2.791023 0.941446 -0.340057
C  1.969916 0.058573 1.784912
C  1.862582 1.951858 -0.563029
C  4.091941 1.062709 -0.799747
C  2.252401 3.095442 -1.243971
C  4.467663 2.208282 -1.488838
C  3.558545 3.224589 -1.709193
C  0.302117 4.346482 -0.757104
C  -0.912983 4.503716 -1.404175
C  0.394797 4.481951 0.621911
C  -2.045804 4.805334 -0.662712
C  -0.747322 4.769951 1.35201
C  -1.969355 4.934224 0.715443
H  -0.568039 -4.1532 0.880615
H  -0.739484 -1.849331 -1.161829
H  0.46924 -5.994979 -1.444429
H  1.384184 -4.981446 -0.333708
H  1.545303 -4.751695 -2.073259
H  -1.553323 -5.053064 -2.711676
H  -0.486025 -3.847575 -3.42369
H  -1.940138 -3.339257 -2.571305
H  -3.116831 -4.317826 -0.415536
H  3.224388 -0.985224 0.493681
H  0.846642 1.846032 -0.20289
H  4.811458 0.273774 -0.622186
H  5.48204 2.31203 -1.849557
H  3.846353 4.122937 -2.239111
H  -0.963702 4.398221 -2.479823
H  1.346978 4.36493 1.123502
H  -2.993737 4.933232 -1.168086
H  -0.676567 4.870663 2.426685
H  -2.855702 5.163086 1.291248
totalener: -2050.65964985 hartree
nucrepener: 2786.85457917 hartree
electener: -4837.51422902 hartree
oneelecener: -8349.50404957 hartree
twoeener: 3511.98982055 hartree
kineticenergy: 2044.53764850 hartree
xcener: -151.870498343096 hartree
chargesum: -0.0000000
charge: -0.021894 -0.041818 -0.266605 -0.369718 -0.295889 -0.003728 0.116566 -0.019819 -0.151199 -0.251666 -0.268259 -0.248214 0.354808 0.094607 0.340691 0.043743 -0.264535 -0.187778 -0.158762 0.223315 -0.090039 -0.205671 0.248384 -0.204291 -0.177539 -0.093012 -0.103483 -0.139744 0.111901 0.107197 0.086046 0.104646 0.087015 0.093810 0.096039 0.088047 0.118299 0.105210 0.128470 0.112599 0.127806 0.129166 0.124645 0.135881 0.125906 0.131464 0.127404
qa: -0.0219 -0.0418 -0.2666 -0.3697 -0.2959 -0.0037 0.1166 -0.0198 -0.1512 -0.2517 -0.2683 -0.2482 0.3548 0.0946 0.3407 0.0437 -0.2645 -0.1878 -0.1588 0.2233 -0.0900 -0.2057 0.2484 -0.2043 -0.1775 -0.0930 -0.1035 -0.1397 0.1119 0.1072 0.0860 0.1046 0.0870 0.0938 0.0960 0.0880 0.1183 0.1052 0.1285 0.1126 0.1278 0.1292 0.1246 0.1359 0.1259 0.1315 0.1274
va: 1.3149 1.2635 2.1560 2.1307 2.1177 3.1144 3.7167 3.8492 3.8998 3.9004 3.9154 3.9099 4.1834 4.2055 3.8356 3.7450 3.9925 3.9711 3.9822 3.8602 3.9688 4.0385 3.7868 4.0472 3.9718 3.9321 3.9460 3.9616 1.0247 1.0209 1.0025 1.0204 1.0020 1.0013 1.0062 1.0009 1.0173 1.0315 1.0237 1.0112 1.0003 1.0121 1.0134 1.0029 0.9991 0.9992 1.0002
dispcorr: -0.024072702 hartree
energy: -2050.683722548724
dipole: 16.39628 -16.31812 0.07816 -1.98944 1.62280 -0.36663 -18.08569 16.30088 -1.78481
magnitude: 1.82375 au
magnitude: 4.63561 debye
