program: Orca
programVersion: 5.0.2
elementType: Cl Cl O O O N C C C C C C C C C C C C C C C C C C C C C C H H H H H H H H H H H H H H H H H H H
charge: 0
multiplicity: 1
keywords: wb97x-d3
keywords: def2-TZVPP
keywords: def2/J RIJCOSX
keywords: DEFGRID2
keywords: scfconv7
keywords: smallprint printgap noloewdin
keywords: NOSOSCF
formula: C22H19Cl2NO3
InChI: InChI=1/C22H19Cl2NO3/c1-22(2)17(12-19(23)24)20(22)21(26)28-18(13-25)14-7-6-10-16(11-14)27-15-8-4-3-5-9-15/h3-12,17-18,20H,1-2H3
47 atoms
Cl -1.298593 -3.925062 2.573047
Cl -3.452422 -5.581745 1.602338
O  0.587218 -0.344935 1.08289
O  1.862281 -2.024948 0.336349
O  1.348303 3.466863 -2.399412
N  1.056765 2.156283 3.194873
C  -0.696569 -2.450582 -1.4642
C  -0.575682 -3.516885 -0.424009
C  -0.507174 -2.075094 -0.001305
C  0.423845 -2.264255 -2.457486
C  -2.059825 -2.142321 -2.035964
C  -1.73401 -4.352273 -0.037643
C  0.778459 -1.527602 0.47085
C  -2.108994 -4.584445 1.213081
C  1.762313 0.387338 1.406339
C  2.334906 1.05932 0.181478
C  1.351481 1.372803 2.408863
C  1.550109 1.976092 -0.509666
C  3.602618 0.731733 -0.267518
C  2.054155 2.580598 -1.651557
C  4.094485 1.341408 -1.41387
C  3.331182 2.262711 -2.10556
C  0.288351 4.132856 -1.842347
C  0.460332 4.952867 -0.7348
C  -0.953296 4.00264 -2.44238
C  -0.629357 5.639742 -0.224817
C  -2.034316 4.705657 -1.929452
C  -1.87841 5.519358 -0.818117
H  0.380888 -4.033789 -0.402958
H  -1.38196 -1.654512 0.480874
H  1.39753 -2.537201 -2.058526
H  0.47748 -1.226585 -2.791323
H  0.239948 -2.884223 -3.336618
H  -2.283784 -2.805592 -2.873774
H  -2.093149 -1.117955 -2.409405
H  -2.858159 -2.25333 -1.301742
H  -2.302416 -4.834367 -0.824641
H  2.515309 -0.264427 1.860632
H  0.555809 2.215828 -0.152629
H  4.197746 0.000406 0.262361
H  5.083755 1.093242 -1.773891
H  3.711364 2.741575 -2.998288
H  1.434893 5.05201 -0.273875
H  -1.065343 3.362103 -3.307286
H  -0.498517 6.274534 0.641209
H  -3.004066 4.608778 -2.399194
H  -2.724203 6.060698 -0.416626
totalener: -2050.65956639 hartree
nucrepener: 2786.35130124 hartree
electener: -4837.01086763 hartree
oneelecener: -8348.22737926 hartree
twoeener: 3511.21651163 hartree
kineticenergy: 2044.54853926 hartree
xcener: -151.872778548127 hartree
chargesum: 0.0000000
charge: -0.029231 -0.040497 -0.260685 -0.369390 -0.295979 -0.002527 0.109228 0.001511 -0.160656 -0.248567 -0.268617 -0.255704 0.356327 0.094761 0.340200 0.011102 -0.267304 -0.197999 -0.143694 0.229922 -0.080784 -0.209903 0.231852 -0.164064 -0.193013 -0.105368 -0.102507 -0.132331 0.107046 0.108418 0.101525 0.090131 0.087556 0.093578 0.095530 0.089354 0.118309 0.121204 0.128977 0.112039 0.127841 0.128587 0.134857 0.124055 0.130814 0.126216 0.127880
qa: -0.0292 -0.0405 -0.2607 -0.3694 -0.2960 -0.0025 0.1092 0.0015 -0.1607 -0.2486 -0.2686 -0.2557 0.3563 0.0948 0.3402 0.0111 -0.2673 -0.1980 -0.1437 0.2299 -0.0808 -0.2099 0.2319 -0.1641 -0.1930 -0.1054 -0.1025 -0.1323 0.1070 0.1084 0.1015 0.0901 0.0876 0.0936 0.0955 0.0894 0.1183 0.1212 0.1290 0.1120 0.1278 0.1286 0.1349 0.1241 0.1308 0.1262 0.1279
va: 1.3019 1.2648 2.1304 2.1353 2.1156 3.1204 3.7430 3.8276 3.8763 3.9002 3.9112 3.9103 4.2043 4.2058 3.8276 3.6712 4.0312 3.9489 4.0027 3.8413 3.9517 4.0363 3.8083 3.9767 4.0377 3.9468 3.9357 3.9551 1.0272 1.0238 1.0195 1.0022 1.0032 1.0014 1.0068 1.0009 1.0177 1.0183 1.0231 1.0183 0.9992 1.0122 1.0032 1.0127 0.9995 0.9993 0.9999
dispcorr: -0.025141926 hartree
energy: -2050.684708320379
dipole: 7.55432 -7.72326 -0.16893 22.59254 -22.83609 -0.24355 -27.33117 25.71443 -1.61675
magnitude: 1.64369 au
magnitude: 4.17793 debye
