program: Orca
programVersion: 5.0.2
elementType: Cl Cl O O O N C C C C C C C C C C C C C C C C C C C C C C H H H H H H H H H H H H H H H H H H H
charge: 0
multiplicity: 1
keywords: wb97x-d3
keywords: def2-TZVPP
keywords: def2/J RIJCOSX
keywords: DEFGRID2
keywords: scfconv7
keywords: smallprint printgap noloewdin
keywords: NOSOSCF
formula: C22H19Cl2NO3
InChI: InChI=1/C22H19Cl2NO3/c1-22(2)17(12-19(23)24)20(22)21(26)28-18(13-25)14-7-6-10-16(11-14)27-15-8-4-3-5-9-15/h3-12,17-18,20H,1-2H3
47 atoms
Cl 0.862693 -4.997411 0.298146
Cl -0.810941 -7.09084 1.367473
O  0.938337 -0.898909 0.734166
O  -0.181222 -1.145157 -1.190182
O  -0.27464 3.864059 -1.816862
N  4.167127 -0.460462 1.259214
C  -2.442866 -2.193533 0.723825
C  -1.72854 -3.333615 0.079597
C  -0.925352 -2.269061 0.787872
C  -3.129168 -1.172928 -0.149895
C  -3.150431 -2.432227 2.036689
C  -1.778173 -4.705264 0.632057
C  -0.05656 -1.393837 -0.021388
C  -0.716311 -5.491526 0.750586
C  1.867772 -0.027771 0.097435
C  1.435479 1.412827 0.222802
C  3.152847 -0.273923 0.754546
C  0.802183 2.021853 -0.85123
C  1.638009 2.114278 1.40496
C  0.371807 3.337407 -0.742754
C  1.201508 3.424624 1.501863
C  0.566976 4.044561 0.437158
C  -0.130262 5.192798 -2.106817
C  1.121187 5.794337 -2.159103
C  -1.274868 5.916978 -2.401804
C  1.215927 7.133477 -2.502267
C  -1.164576 7.254306 -2.753172
C  0.077222 7.869314 -2.798495
H  -1.665995 -3.28508 -1.00505
H  -0.518776 -2.53004 1.757822
H  -3.160355 -0.199846 0.342995
H  -4.159487 -1.48261 -0.333312
H  -2.645142 -1.043924 -1.114452
H  -3.243495 -1.500022 2.595371
H  -2.627075 -3.147343 2.671907
H  -4.15859 -2.81492 1.865443
H  -2.738031 -5.110788 0.930299
H  1.976924 -0.292688 -0.958533
H  0.631414 1.480156 -1.772757
H  2.142158 1.649329 2.242426
H  1.356204 3.975934 2.419559
H  0.230673 5.069134 0.527724
H  2.01377 5.222783 -1.938598
H  -2.24045 5.430487 -2.360067
H  2.190307 7.601843 -2.544831
H  -2.058244 7.818264 -2.985256
H  0.159032 8.913634 -3.067231
totalener: -2050.66022562 hartree
nucrepener: 2697.36748731 hartree
electener: -4748.02771293 hartree
oneelecener: -8170.21415564 hartree
twoeener: 3422.18644271 hartree
kineticenergy: 2044.53994920 hartree
xcener: -151.871301891010 hartree
chargesum: 0.0000000
charge: -0.028222 -0.039359 -0.252551 -0.389224 -0.295782 -0.003540 0.113705 -0.018832 -0.164767 -0.252866 -0.269703 -0.245896 0.392150 0.092631 0.314515 -0.004828 -0.256110 -0.151608 -0.157638 0.180127 -0.121226 -0.137429 0.219896 -0.147996 -0.196292 -0.119830 -0.099032 -0.136079 0.110148 0.107145 0.091035 0.086706 0.103198 0.096313 0.088969 0.093975 0.118639 0.121850 0.125442 0.121730 0.130935 0.134935 0.135050 0.126772 0.128800 0.126799 0.127343
qa: -0.0282 -0.0394 -0.2526 -0.3892 -0.2958 -0.0035 0.1137 -0.0188 -0.1648 -0.2529 -0.2697 -0.2459 0.3921 0.0926 0.3145 -0.0048 -0.2561 -0.1516 -0.1576 0.1801 -0.1212 -0.1374 0.2199 -0.1480 -0.1963 -0.1198 -0.0990 -0.1361 0.1101 0.1071 0.0910 0.0867 0.1032 0.0963 0.0890 0.0940 0.1186 0.1218 0.1254 0.1217 0.1309 0.1349 0.1350 0.1268 0.1288 0.1268 0.1273
va: 1.3053 1.2667 2.1265 2.1108 2.1069 3.1171 3.7282 3.8392 3.8927 3.9021 3.9139 3.9069 4.1547 4.2048 3.8194 3.7078 4.0240 4.0096 4.0354 3.9172 3.9664 3.9363 3.8203 3.9396 4.0316 3.9476 3.9392 3.9535 1.0256 1.0248 1.0017 1.0025 1.0199 1.0064 1.0009 1.0012 1.0172 1.0206 1.0331 1.0168 1.0013 1.0029 1.0024 1.0127 0.9997 0.9989 0.9999
dispcorr: -0.023766713 hartree
energy: -2050.683992337024
dipole: -17.87225 16.12755 -1.74470 40.15249 -38.97421 1.17828 -3.09827 3.18816 0.08988
magnitude: 2.10723 au
magnitude: 5.35615 debye
