program: Gaussian 09
title: 000007269
version: EM64L-G09RevD.01
frameworkgroup: C1[X(C10H14)]
method: RPBEPBE
basis: SDD
operation: Freq
keyword: #p
keyword: freq=noraman
keyword: PBEPBE/SDD
title: #p freq=noraman PBEPBE/SDD
converged: NO NO NO NO
title: Mulliken charges:
elementType: C C C C C C C C C C H H H H H H H H H H H H H H
charge: 0.346364 0.346369 0.346366 0.346367 -0.636666 -0.636667 -0.818335 -0.818337 -0.818333 -0.818333 0.231857 0.231853 0.228352 0.222935 0.223086 0.223004 0.228353 0.223017 0.223111 0.222909 0.228352 0.228353 0.223008 0.223013
chargesum: 0.00000
title: Mulliken charges with hydrogens summed into heavy atoms:
elementType: C C C C C C C C C C
charge: 0.346364 0.346369 0.346366 0.346367 -0.404809 -0.404813 -0.143962 -0.143963 -0.143960 -0.143959
polarizability: 1.42590378e+02 1.65185355e-04 1.15435779e+02 8.70292396e-03 -1.03310435e-03 6.29662621e+01
1716.lowfreq: -10.3821 -0.0004 -0.0004 0.0009 18.4349 29.2090 111.3324 123.5512 131.8397
frequency: 111.3324 123.4652 131.8397 140.1705 167.2536 195.2004 268.4907 277.7487 286.9240 296.8281 349.6551 426.0347 455.9297 498.8837 514.2138 594.1460 659.1601 730.9702 732.6957 799.4170 878.4882 890.6059 977.0133 991.2095 1007.1135 1024.2008 1028.3711 1035.6810 1054.6846 1054.9467 1078.0947 1191.6040 1205.8434 1276.3021 1290.4817 1364.9059 1385.9702 1394.0037 1397.5457 1406.8394 1406.9307 1464.5376 1464.6868 1465.2050 1474.1882 1478.2696 1479.4297 1480.0834 1480.4506 1504.7930 1579.2686 1627.9706 2965.0936 2966.3869 2966.7737 2966.9224 3037.9693 3038.2700 3041.7480 3041.9357 3072.8960 3073.2334 3075.5233 3075.7710 3108.2212 3112.1966
redmass: 2.2088 1.0552 1.1308 1.5440 1.0356 1.4744 2.7929 2.4737 2.5903 2.5041 3.2210 4.4343 2.6507 4.6898 2.5728 3.2401 3.8205 5.9051 2.7205 2.9897 1.2888 1.3058 1.5744 1.3128 1.4520 1.4148 1.7676 1.4591 1.6062 1.6741 3.0301 4.6274 1.4069 1.2492 7.0967 5.6186 2.1951 1.2342 1.6202 1.1969 1.2627 1.0462 1.0620 1.0473 1.1133 1.0451 1.0462 1.1662 1.2070 2.8116 6.4374 6.4762 1.0369 1.0369 1.0377 1.0377 1.0972 1.0972 1.0971 1.0970 1.0988 1.0988 1.0979 1.0981 1.0904 1.0912
irintensity: 0.0000 0.0000 0.0001 6.6325 0.0000 0.9445 0.0000 0.0000 1.0017 0.4768 0.0000 0.0000 9.4182 0.0000 0.0000 0.0000 1.4417 0.0000 0.0000 0.0583 17.3000 0.0000 0.0132 0.0000 28.1619 0.0001 0.0001 31.2431 0.0002 0.0002 0.0000 3.7687 0.1264 0.0000 0.0000 1.6493 6.1635 0.0000 6.5562 0.0349 26.9555 0.0008 0.0000 0.0000 0.0001 0.0037 58.1262 0.3735 53.5770 31.8209 0.0000 0.0000 143.0877 0.0010 0.0052 31.3445 0.0039 99.8619 0.0001 0.0002 0.0428 76.1771 13.1714 0.0140 52.7234 0.0003
temp: 298.150 k
press: 1.00000 atm
elementType: 6 6 6 6 6 6 6 6 6 6 1 1 1 1 1 1 1 1 1 1 1 1 1 1
symmnumber: 1
zpe: 545156.3 jmol-1
zpe.correction: 0.207639 hartree
zpe.thermalcorrener: 0.218654 hartree
zpe.thermalcorrenthalpy: 0.219599 hartree
zpe.thermalcorrgfe: 0.172006 hartree
zpe.sumelectzpe: -388.723602 hartree
zpe.sumelectthermal: -388.712587 hartree
zpe.sumelectthermalent: -388.711643 hartree
zpe.sumelectthermalfe: -388.759236 hartree
dipole: 0.0000 0.0000 0.0002
dipole: 0.0002
quadrupole: -55.2578 -57.6080 -64.6750
quadrupole: 0.0001 0.0037 -0.0002
quadrupole: 3.9225 1.5723 -5.4948 0.0001 0.0037 -0.0002
hfenergy: -388.9312415 hartree
pointgroup: C01 [X(C10H14)]
dipole: -0.000001 0.0000018 0.0000918 debye
dipolederiv: 0.1668205 0.1717593 0.0002126 0.220011 0.0129053 0.000182 0.000707 0.0005367 -0.046258 0.1668538 -0.1717471 0.0000403 -0.2200032 0.0128711 -0.0001024 0.0000967 -0.0001528 -0.0462573 0.1668571 -0.1717452 0.0002586 -0.2200043 0.0128815 -0.000205 0.0009355 -0.0006632 -0.0462559 0.1668155 0.1717586 0.0000656 0.2200117 0.0128989 0.0001263 0.00008 0.0001702 -0.0462602 -0.1553374 -0.0000056 -0.0000611 -0.0000029 0.0408229 -0.000014 -0.0001626 0.0000057 -0.1986931 -0.1553292 -0.0000056 -0.0000005 -0.0000006 0.0408315 -0.0000138 -0.0000802 -0.0000037 -0.198692 -0.1023325 -0.0962347 -0.0000705 -0.038346 0.0610828 -0.0001122 -0.0007399 -0.0005211 0.0740225 -0.1023415 0.0962212 -0.0000472 0.0383301 0.061098 0.000009 -0.0002099 0.0000313 0.0740228 -0.1023477 0.0962218 -0.0000742 0.0383389 0.0610929 0.0001387 -0.0009608 0.0006644 0.0740223 -0.1023334 -0.096237 -0.0000509 -0.0383448 0.0610824 -0.0000052 -0.0002267 0.0000032 0.0740246 0.0696952 0.0000021 0.0000791 0.0000061 -0.1477774 -0.0000042 0.0000847 -0.0000193 0.1433985 0.0696932 0.0000036 0.000016 0.0000065 -0.1477857 0.0000024 0.0000363 0.0000012 0.1433972 0.0773847 0.0950779 -0.0002832 -0.0241423 -0.1580552 0.0006857 0.0000717 0.000719 0.1059066 -0.0498777 -0.0250622 0.094703 0.0112165 0.0686252 -0.0728445 0.1431081 -0.0205739 -0.0523349 -0.0491891 -0.0259 -0.0945688 0.0100026 0.0689298 0.0721612 -0.1430244 0.0199207 -0.05369 -0.049649 0.0253768 0.0946591 -0.0107989 0.0687442 0.0725916 0.1430761 0.0203553 -0.0528302 0.0773907 -0.095059 -0.0000632 0.0241613 -0.1580616 -0.0001231 0.0000192 -0.0001333 0.1059093 -0.049421 0.0255677 -0.0946058 -0.0104388 0.0688123 -0.0724349 -0.1430566 -0.0201655 -0.0531965 -0.0490946 0.0260252 -0.094544 -0.0098152 0.0689878 -0.0720453 -0.1430086 -0.0198204 -0.0538996 -0.0499695 0.0249136 0.0947109 -0.0114302 0.0685668 0.0729764 0.1431133 0.0206991 -0.052124 0.0773898 -0.0950532 -0.0003811 0.0241643 -0.1580588 -0.0009275 0.0000981 -0.0009695 0.1059049 0.077387 0.0950835 -0.0000619 -0.0241398 -0.1580504 0.0001061 0.0000179 0.000114 0.1059082 -0.0496546 -0.025388 0.0946706 0.0108003 0.0687471 -0.0725792 0.1430802 -0.0203477 -0.0528304 -0.0494104 -0.0255737 -0.0946036 0.0104178 0.0688085 0.0724316 -0.143055 0.0201496 -0.0531947 unknown
polarizability: 142.5903703|0.0012478|115.4357789|0.0268867|-0.0011776|62.9662702 unknown
InChI: InChI=1S/C10H14/c1-7-5-9(3)10(4)6-8(7)2/h5-6H,1-4H3
charge 0 multiplicity 1
24 atoms
C  -1.242854 -0.712755 -0.000039
C  -1.242911 0.712677 -0.000003
C  1.242938 -0.712665 0.000227
C  1.242892 0.712773 0.000202
C  0.000073 -1.392269 0.000078
C  -0.000036 1.392278 0.0001
C  -2.545094 -1.496212 -0.000662
C  -2.545212 1.496028 -0.000287
C  2.54525 -1.496012 0.000934
C  2.545128 1.496232 0.000519
H  0.000098 -2.49004 0.000051
H  -0.000067 2.490051 0.000091
H  -2.356379 -2.584083 0.002565
H  -3.164882 -1.260123 0.886098
H  -3.16088 -1.264731 -0.891454
H  -3.163518 1.26176 0.888003
H  -2.356583 2.583918 0.000349
H  -3.162454 1.262617 -0.889553
H  3.160426 -1.265289 0.892352
H  3.165598 -1.259043 -0.885191
H  2.356634 -2.583895 -0.003412
H  2.356398 2.584102 -0.000059
H  3.163456 1.262071 -0.887784
H  3.162379 1.26281 0.889774
