program: Orca
programVersion: 5.0.2
elementType: Cl Cl O O O N C C C C C C C C C C C C C C C C C C C C C C H H H H H H H H H H H H H H H H H H H
charge: 0
multiplicity: 1
keywords: wb97x-d3
keywords: def2-TZVPP
keywords: def2/J RIJCOSX
keywords: DEFGRID2
keywords: scfconv7
keywords: smallprint printgap noloewdin
keywords: NOSOSCF
formula: C22H19Cl2NO3
InChI: InChI=1/C22H19Cl2NO3/c1-22(2)17(12-19(23)24)20(22)21(26)28-18(13-25)14-7-6-10-16(11-14)27-15-8-4-3-5-9-15/h3-12,17-18,20H,1-2H3
47 atoms
Cl -2.128237 -2.057698 2.428272
Cl -4.734805 -3.063255 1.696409
O  1.127471 -0.658234 0.106397
O  1.681869 -2.756568 0.667817
O  1.75159 4.304354 -1.341262
N  1.946829 0.599489 3.109792
C  -0.581951 -3.433062 -1.416491
C  -1.079076 -3.607129 -0.021326
C  -0.410899 -2.309079 -0.405639
C  0.604095 -4.24539 -1.874982
C  -1.581467 -3.155317 -2.513982
C  -2.523952 -3.625964 0.29727
C  0.901249 -1.983738 0.185384
C  -3.056942 -2.997038 1.336561
C  2.34747 -0.160785 0.63842
C  2.811112 0.979642 -0.229261
C  2.115855 0.263176 2.024369
C  2.027102 2.121742 -0.347517
C  4.001773 0.864753 -0.927964
C  2.441078 3.146628 -1.185174
C  4.41329 1.904285 -1.751157
C  3.638026 3.039423 -1.888375
C  0.40421 4.340604 -1.100224
C  -0.470334 3.506885 -1.784958
C  -0.070063 5.275506 -0.194757
C  -1.831729 3.614315 -1.550518
C  -1.436211 5.379773 0.023248
C  -2.319827 4.548497 -0.647396
H  -0.468044 -4.246489 0.611369
H  -1.0587 -1.45341 -0.556577
H  1.163806 -3.713961 -2.646767
H  0.257714 -5.18469 -2.309156
H  1.290804 -4.487782 -1.067916
H  -2.42353 -2.553498 -2.171047
H  -1.981084 -4.088726 -2.915293
H  -1.106554 -2.620045 -3.337229
H  -3.186949 -4.210055 -0.33031
H  3.107646 -0.946856 0.65953
H  1.105652 2.209495 0.215238
H  4.606786 -0.027817 -0.833538
H  5.343232 1.823964 -2.297551
H  3.949297 3.851292 -2.532367
H  -0.091038 2.784164 -2.49614
H  0.62722 5.917309 0.327232
H  -2.51552 2.966727 -2.083103
H  -1.80822 6.111649 0.727575
H  -3.383633 4.629694 -0.470559
totalener: -2050.65948531 hartree
nucrepener: 2773.99589988 hartree
electener: -4824.65538519 hartree
oneelecener: -8323.50081818 hartree
twoeener: 3498.84543299 hartree
kineticenergy: 2044.53833068 hartree
xcener: -151.869795823925 hartree
chargesum: 0.0000000
charge: -0.021653 -0.041119 -0.262854 -0.373928 -0.295181 0.001935 0.116456 -0.020407 -0.158890 -0.253648 -0.271302 -0.242203 0.371996 0.087735 0.328369 0.038957 -0.274492 -0.173784 -0.159205 0.216760 -0.084979 -0.205637 0.219195 -0.157566 -0.184707 -0.113000 -0.097019 -0.132868 0.110766 0.103677 0.089143 0.087147 0.102980 0.088089 0.094228 0.095424 0.117880 0.111577 0.132190 0.113969 0.128087 0.129350 0.130027 0.127346 0.126070 0.127729 0.127362
qa: -0.0217 -0.0411 -0.2629 -0.3739 -0.2952 0.0019 0.1165 -0.0204 -0.1589 -0.2536 -0.2713 -0.2422 0.3720 0.0877 0.3284 0.0390 -0.2745 -0.1738 -0.1592 0.2168 -0.0850 -0.2056 0.2192 -0.1576 -0.1847 -0.1130 -0.0970 -0.1329 0.1108 0.1037 0.0891 0.0871 0.1030 0.0881 0.0942 0.0954 0.1179 0.1116 0.1322 0.1140 0.1281 0.1293 0.1300 0.1273 0.1261 0.1277 0.1274
va: 1.3123 1.2644 2.1526 2.1301 2.1128 3.1189 3.7191 3.8500 3.8888 3.9027 3.9159 3.9021 4.1832 4.2117 3.8120 3.7580 4.0338 3.9683 3.9766 3.8725 3.9601 4.0406 3.8301 3.9725 4.0426 3.9440 3.9379 3.9593 1.0253 1.0229 1.0011 1.0031 1.0200 1.0002 1.0015 1.0061 1.0167 1.0381 1.0187 1.0098 1.0000 1.0122 1.0040 1.0122 1.0000 0.9992 1.0001
dispcorr: -0.023785139 hartree
energy: -2050.683270445000
dipole: 13.06835 -13.34303 -0.27468 3.86668 -4.10833 -0.24166 -27.46635 25.27094 -2.19541
magnitude: 2.22569 au
magnitude: 5.65724 debye
