program: Orca
programVersion: 5.0.2
elementType: Cl Cl O O O N C C C C C C C C C C C C C C C C C C C C C C H H H H H H H H H H H H H H H H H H H
charge: 0
multiplicity: 1
keywords: wb97x-d3
keywords: def2-TZVPP
keywords: def2/J RIJCOSX
keywords: DEFGRID2
keywords: scfconv7
keywords: smallprint printgap noloewdin
keywords: NOSOSCF
formula: C22H19Cl2NO3
InChI: InChI=1/C22H19Cl2NO3/c1-22(2)17(12-19(23)24)20(22)21(26)28-18(13-25)14-7-6-10-16(11-14)27-15-8-4-3-5-9-15/h3-12,17-18,20H,1-2H3
47 atoms
Cl -0.498886 -3.5446 3.125274
Cl -2.47804 -5.568629 3.703417
O  -0.003128 -0.88386 0.00891
O  1.432186 -2.528818 -0.480106
O  0.939817 4.195044 -2.443248
N  2.289768 -0.102519 2.341111
C  -1.226012 -4.101753 -1.129979
C  -0.689893 -4.489749 0.205334
C  -0.882763 -3.025136 -0.112664
C  -0.366823 -4.315397 -2.351385
C  -2.702188 -4.276157 -1.395932
C  -1.53372 -5.13171 1.237004
C  0.315314 -2.172258 -0.225541
C  -1.507554 -4.791229 2.518801
C  1.064076 0.050495 0.033176
C  0.488846 1.429969 -0.16217
C  1.757009 -0.0483 1.324983
C  0.968538 2.223649 -1.190158
C  -0.504538 1.906294 0.685394
C  0.449788 3.498863 -1.384899
C  -1.01869 3.173918 0.478556
C  -0.553619 3.976822 -0.553174
C  0.989461 5.561175 -2.413289
C  1.481206 6.255813 -1.315108
C  0.586279 6.238218 -3.553958
C  1.553278 7.638992 -1.365188
C  0.67641 7.621423 -3.594987
C  1.15267 8.327836 -2.501116
H  0.351492 -4.803074 0.21162
H  -1.736407 -2.537529 0.343327
H  -0.630245 -3.607104 -3.138764
H  -0.533335 -5.319977 -2.743796
H  0.695791 -4.211911 -2.146246
H  -3.036199 -3.58041 -2.166694
H  -3.311571 -4.102225 -0.508651
H  -2.9121 -5.287041 -1.751019
H  -2.189379 -5.943264 0.944101
H  1.79306 -0.169327 -0.752229
H  1.745995 1.865251 -1.853775
H  -0.873366 1.296348 1.499266
H  -1.79795 3.549713 1.127704
H  -0.973446 4.962565 -0.703862
H  1.810152 5.724914 -0.430915
H  0.21231 5.680084 -4.402158
H  1.935603 8.179884 -0.509691
H  0.364874 8.147728 -4.487438
H  1.215452 9.406922 -2.533962
totalener: -2050.65929876 hartree
nucrepener: 2664.16726224 hartree
electener: -4714.82656100 hartree
oneelecener: -8103.88839092 hartree
twoeener: 3389.06182993 hartree
kineticenergy: 2044.53657754 hartree
xcener: -151.870086792526 hartree
chargesum: -0.0000000
charge: -0.022078 -0.041212 -0.265583 -0.367634 -0.297081 -0.001904 0.115253 -0.021706 -0.149975 -0.252321 -0.268543 -0.245400 0.356341 0.091417 0.330653 0.052668 -0.263451 -0.179958 -0.180554 0.209190 -0.114076 -0.155929 0.246631 -0.174482 -0.207678 -0.112267 -0.092365 -0.142669 0.113176 0.103627 0.087738 0.087244 0.103784 0.095852 0.087630 0.094391 0.118347 0.105989 0.115197 0.124555 0.130931 0.136613 0.138619 0.126160 0.129841 0.127330 0.127690
qa: -0.0221 -0.0412 -0.2656 -0.3676 -0.2971 -0.0019 0.1153 -0.0217 -0.1500 -0.2523 -0.2685 -0.2454 0.3563 0.0914 0.3307 0.0527 -0.2635 -0.1800 -0.1806 0.2092 -0.1141 -0.1559 0.2466 -0.1745 -0.2077 -0.1123 -0.0924 -0.1427 0.1132 0.1036 0.0877 0.0872 0.1038 0.0959 0.0876 0.0944 0.1183 0.1060 0.1152 0.1246 0.1309 0.1366 0.1386 0.1262 0.1298 0.1273 0.1277
va: 1.3139 1.2644 2.1503 2.1327 2.1101 3.1140 3.7206 3.8474 3.8941 3.9009 3.9148 3.9062 4.1906 4.2081 3.8190 3.7311 3.9961 4.0405 4.0500 3.9263 3.9585 3.9401 3.7951 3.9547 4.0420 3.9437 3.9343 3.9622 1.0251 1.0219 1.0020 1.0028 1.0197 1.0064 1.0006 1.0011 1.0168 1.0325 1.0230 1.0193 1.0007 1.0025 1.0015 1.0135 0.9994 0.9986 1.0000
dispcorr: -0.023265469 hartree
energy: -2050.682564228025
dipole: -1.97000 0.49668 -1.47332 20.76853 -20.09680 0.67173 -31.81296 30.26048 -1.55249
magnitude: 2.24324 au
magnitude: 5.70185 debye
