program: Orca
programVersion: 5.0.2
elementType: Cl Cl O O O N C C C C C C C C C C C C C C C C C C C C C C H H H H H H H H H H H H H H H H H H H
charge: 0
multiplicity: 1
keywords: wb97x-d3
keywords: def2-TZVPP
keywords: def2/J RIJCOSX
keywords: DEFGRID2
keywords: scfconv7
keywords: smallprint printgap noloewdin
keywords: NOSOSCF
formula: C22H19Cl2NO3
InChI: InChI=1/C22H19Cl2NO3/c1-22(2)17(12-19(23)24)20(22)21(26)28-18(13-25)14-7-6-10-16(11-14)27-15-8-4-3-5-9-15/h3-12,17-18,20H,1-2H3
47 atoms
Cl -4.379466 -2.808578 -0.520596
Cl -3.845342 -5.619799 -0.152986
O  1.939611 -1.280052 -0.424375
O  0.02865 -0.140301 -0.665932
O  1.76458 4.412044 0.432744
N  4.955507 -1.158409 -1.779617
C  -0.735191 -1.96736 1.79268
C  -1.458577 -2.394782 0.547917
C  0.042192 -2.223034 0.514795
C  -0.953612 -0.558879 2.289939
C  -0.517652 -2.95932 2.910585
C  -2.032065 -3.739733 0.407376
C  0.618818 -1.10025 -0.25257
C  -3.254565 -4.010492 -0.032658
C  2.64916 -0.196704 -1.018538
C  2.825336 0.940174 -0.041083
C  3.937936 -0.751773 -1.436868
C  2.214758 2.156175 -0.301571
C  3.547902 0.745558 1.129197
C  2.313774 3.186109 0.626351
C  3.652502 1.784202 2.039276
C  3.032995 2.999801 1.79907
C  0.626633 4.565007 -0.310148
C  0.574632 5.657768 -1.162396
C  -0.462371 3.710946 -0.18773
C  -0.577636 5.899734 -1.893843
C  -1.60296 3.958114 -0.935417
C  -1.668514 5.050198 -1.788273
H  -2.008336 -1.602172 0.053425
H  0.646647 -3.123473 0.516688
H  -0.063457 -0.184476 2.799114
H  -1.774136 -0.5511 3.008946
H  -1.205535 0.139616 1.495755
H  -1.411051 -3.034917 3.532314
H  0.306007 -2.635497 3.548267
H  -0.276999 -3.961039 2.55688
H  -1.421352 -4.590259 0.683665
H  2.129918 0.157766 -1.914801
H  1.648405 2.289609 -1.214023
H  4.030235 -0.203023 1.327718
H  4.21745 1.646663 2.951333
H  3.106346 3.810484 2.511899
H  1.43194 6.313118 -1.242338
H  -0.42413 2.855706 0.474557
H  -0.617068 6.754791 -2.555563
H  -2.447235 3.287758 -0.845519
H  -2.563266 5.237219 -2.366113
totalener: -2050.66088565 hartree
nucrepener: 2753.82226938 hartree
electener: -4804.48315503 hartree
oneelecener: -8282.72258097 hartree
twoeener: 3478.23942594 hartree
kineticenergy: 2044.54014770 hartree
xcener: -151.872697707216 hartree
chargesum: -0.0000000
charge: -0.039698 -0.042746 -0.254475 -0.376287 -0.295628 0.000731 0.070018 0.043731 -0.084488 -0.241212 -0.242401 -0.207415 0.338441 0.051555 0.316058 0.019545 -0.259291 -0.155309 -0.202321 0.250905 -0.087036 -0.203499 0.259047 -0.212443 -0.171311 -0.089824 -0.110900 -0.141913 0.087659 0.083180 0.092557 0.094083 0.084660 0.100280 0.095330 0.073202 0.099112 0.118082 0.123101 0.123338 0.129391 0.129357 0.125568 0.130324 0.126234 0.126320 0.126387
qa: -0.0397 -0.0427 -0.2545 -0.3763 -0.2956 0.0007 0.0700 0.0437 -0.0845 -0.2412 -0.2424 -0.2074 0.3384 0.0516 0.3161 0.0195 -0.2593 -0.1553 -0.2023 0.2509 -0.0870 -0.2035 0.2590 -0.2124 -0.1713 -0.0898 -0.1109 -0.1419 0.0877 0.0832 0.0926 0.0941 0.0847 0.1003 0.0953 0.0732 0.0991 0.1181 0.1231 0.1233 0.1294 0.1294 0.1256 0.1303 0.1262 0.1263 0.1264
va: 1.2879 1.2628 2.1410 2.1264 2.1241 3.1189 3.7676 3.8254 3.8615 3.9147 3.9075 3.9192 4.2607 4.2484 3.8441 3.6231 4.0199 3.9311 4.0372 3.8637 3.9337 4.0387 3.7960 4.0396 3.9541 3.9305 3.9546 3.9623 1.0487 1.0349 1.0015 1.0038 1.0205 1.0027 1.0040 1.0102 1.0291 1.0182 1.0168 1.0170 0.9992 1.0121 1.0143 0.9983 0.9990 1.0002 1.0002
dispcorr: -0.024698110 hartree
energy: -2050.685583762707
dipole: 14.43025 -15.14759 -0.71735 23.36834 -23.00574 0.36260 14.80258 -13.65309 1.14949
magnitude: 1.40264 au
magnitude: 3.56522 debye
