program: Orca
programVersion: 5.0.2
elementType: Cl Cl O O O N C C C C C C C C C C C C C C C C C C C C C C H H H H H H H H H H H H H H H H H H H
charge: 0
multiplicity: 1
keywords: wb97x-d3
keywords: def2-TZVPP
keywords: def2/J RIJCOSX
keywords: DEFGRID2
keywords: scfconv7
keywords: smallprint printgap noloewdin
keywords: NOSOSCF
formula: C22H19Cl2NO3
InChI: InChI=1/C22H19Cl2NO3/c1-22(2)17(12-19(23)24)20(22)21(26)28-18(13-25)14-7-6-10-16(11-14)27-15-8-4-3-5-9-15/h3-12,17-18,20H,1-2H3
47 atoms
Cl -0.805753 -4.326843 1.41965
Cl -3.617631 -4.93682 1.671371
O  1.165327 -0.468859 0.924047
O  1.233629 -1.599634 -1.010719
O  1.490123 4.002489 -1.445192
N  3.415273 -0.128153 3.331587
C  -1.835727 -0.804116 -0.972836
C  -1.648944 -2.25433 -0.680242
C  -0.8558 -1.241356 0.10707
C  -1.331836 -0.259688 -2.286572
C  -3.074695 -0.103689 -0.469233
C  -2.685381 -3.05979 0.002901
C  0.602165 -1.155109 -0.094436
C  -2.407766 -3.984652 0.912296
C  2.557667 -0.249758 0.865183
C  2.934781 1.022459 0.128464
C  3.017089 -0.180552 2.255562
C  1.966508 1.919982 -0.297057
C  4.279934 1.272952 -0.097053
C  2.358845 3.078215 -0.959264
C  4.656088 2.436087 -0.749084
C  3.704963 3.341803 -1.18113
C  0.147848 3.905549 -1.204836
C  -0.692473 3.674027 -2.28287
C  -0.369046 4.098778 0.069447
C  -2.065205 3.644738 -2.084332
C  -1.741902 4.055927 0.257585
C  -2.593496 3.830587 -0.815582
H  -1.06041 -2.801792 -1.412615
H  -1.179962 -1.049784 1.123556
H  -1.063085 0.793826 -2.19137
H  -2.120756 -0.33066 -3.037557
H  -0.466362 -0.797939 -2.665241
H  -3.896164 -0.219056 -1.17945
H  -2.884167 0.964506 -0.355583
H  -3.412128 -0.485286 0.49494
H  -3.724571 -2.916719 -0.268649
H  3.059999 -1.098079 0.386584
H  0.919067 1.723696 -0.11501
H  5.03344 0.571616 0.239358
H  5.703809 2.639446 -0.92444
H  3.992795 4.249019 -1.695377
H  -0.26975 3.533086 -3.26903
H  0.295352 4.289646 0.902618
H  -2.722002 3.472253 -2.926627
H  -2.147457 4.210228 1.248584
H  -3.66434 3.80954 -0.663847
totalener: -2050.65864602 hartree
nucrepener: 2846.54442310 hartree
electener: -4897.20306912 hartree
oneelecener: -8468.15864831 hartree
twoeener: 3570.95557920 hartree
kineticenergy: 2044.52714725 hartree
xcener: -151.872799232098 hartree
chargesum: 0.0000000
charge: -0.029609 -0.039007 -0.274188 -0.358955 -0.292500 -0.000142 0.150628 -0.030977 -0.149490 -0.234450 -0.280256 -0.239794 0.329252 0.086032 0.303665 0.065433 -0.251871 -0.207202 -0.225460 0.306217 -0.065013 -0.224039 0.259519 -0.197311 -0.187058 -0.114702 -0.085783 -0.168516 0.112294 0.103581 0.060873 0.090199 0.108563 0.094086 0.089513 0.090414 0.118596 0.131874 0.114521 0.115256 0.127121 0.126683 0.132221 0.136881 0.131192 0.134230 0.137479
qa: -0.0296 -0.0390 -0.2742 -0.3590 -0.2925 -0.0001 0.1506 -0.0310 -0.1495 -0.2344 -0.2803 -0.2398 0.3293 0.0860 0.3037 0.0654 -0.2519 -0.2072 -0.2255 0.3062 -0.0650 -0.2240 0.2595 -0.1973 -0.1871 -0.1147 -0.0858 -0.1685 0.1123 0.1036 0.0609 0.0902 0.1086 0.0941 0.0895 0.0904 0.1186 0.1319 0.1145 0.1153 0.1271 0.1267 0.1322 0.1369 0.1312 0.1342 0.1375
va: 1.3035 1.2675 2.0988 2.1407 2.1279 3.1230 3.6865 3.8727 3.8719 3.8782 3.9143 3.9087 4.1953 4.2082 3.8031 3.7411 3.9931 3.9727 4.0709 3.7855 3.9436 4.0450 3.7555 3.9806 3.9808 3.8601 3.8839 3.8999 1.0253 1.0275 1.0187 1.0047 1.0235 1.0010 1.0180 1.0037 1.0163 1.0226 1.0257 1.0119 0.9990 1.0144 1.0109 1.0037 0.9989 0.9973 0.9977
dispcorr: -0.027720742 hartree
energy: -2050.686366757091
dipole: -3.09754 1.81085 -1.28668 31.83751 -30.99324 0.84428 -19.46441 18.09216 -1.37224
magnitude: 2.06189 au
magnitude: 5.24092 debye
