program: Orca
programVersion: 5.0.2
elementType: Cl Cl O O O N C C C C C C C C C C C C C C C C C C C C C C H H H H H H H H H H H H H H H H H H H
charge: 0
multiplicity: 1
keywords: wb97x-d3
keywords: def2-TZVPP
keywords: def2/J RIJCOSX
keywords: DEFGRID2
keywords: scfconv7
keywords: smallprint printgap noloewdin
keywords: NOSOSCF
formula: C22H19Cl2NO3
InChI: InChI=1/C22H19Cl2NO3/c1-22(2)17(12-19(23)24)20(22)21(26)28-18(13-25)14-7-6-10-16(11-14)27-15-8-4-3-5-9-15/h3-12,17-18,20H,1-2H3
47 atoms
Cl -4.414772 -2.701668 -0.423215
Cl -3.954312 -5.530289 -0.090963
O  1.850314 -1.318781 -0.485135
O  -0.033291 -0.1116 -0.539485
O  2.000895 4.41217 0.229327
N  4.707703 -1.334302 -2.136732
C  -0.700642 -2.005424 1.899295
C  -1.495588 -2.377754 0.681837
C  0.005832 -2.230415 0.57644
C  -0.869737 -0.611357 2.452583
C  -0.442474 -3.038787 2.970234
C  -2.101542 -3.704983 0.518619
C  0.555556 -1.100935 -0.200327
C  -3.325843 -3.937952 0.061939
C  2.532878 -0.267064 -1.159725
C  2.846458 0.878403 -0.228236
C  3.749759 -0.877054 -1.698634
C  2.276552 2.117395 -0.473275
C  3.656017 0.676579 0.881765
C  2.507941 3.16629 0.408162
C  3.890895 1.733788 1.74581
C  3.316301 2.973908 1.520972
C  0.861612 4.600201 -0.505238
C  -0.291824 3.862304 -0.270063
C  0.879584 5.598568 -1.466553
C  -1.429285 4.130556 -1.014779
C  -0.269735 5.864791 -2.195601
C  -1.425165 5.130271 -1.977226
H  -2.051651 -1.558096 0.241695
H  0.591163 -3.141387 0.516638
H  0.046518 -0.274479 2.941094
H  -1.663393 -0.611418 3.201255
H  -1.133147 0.119757 1.692262
H  -1.306902 -3.129611 3.629726
H  0.412941 -2.744979 3.580027
H  -0.227019 -4.028714 2.569833
H  -1.514956 -4.574668 0.787482
H  1.937997 0.095354 -2.004458
H  1.640201 2.254331 -1.337738
H  4.105451 -0.290313 1.068536
H  4.524161 1.591468 2.611154
H  3.491984 3.798137 2.199573
H  -0.302994 3.079573 0.477741
H  1.787826 6.162525 -1.633742
H  -2.325569 3.551448 -0.837378
H  -0.255721 6.646253 -2.943718
H  -2.317677 5.335029 -2.552571
totalener: -2050.66111947 hartree
nucrepener: 2745.17792308 hartree
electener: -4795.83904255 hartree
oneelecener: -8265.50210869 hartree
twoeener: 3469.66306614 hartree
kineticenergy: 2044.54387440 hartree
xcener: -151.873212930253 hartree
chargesum: 0.0000000
charge: -0.039819 -0.043116 -0.254754 -0.377402 -0.295300 0.000003 0.065767 0.043178 -0.082746 -0.240524 -0.245061 -0.207669 0.343657 0.053201 0.309828 0.012350 -0.256508 -0.138492 -0.203799 0.244637 -0.085691 -0.202077 0.247995 -0.169300 -0.204039 -0.108013 -0.094142 -0.139978 0.086369 0.083592 0.091389 0.092978 0.088803 0.100663 0.094853 0.073961 0.098505 0.118193 0.118922 0.123287 0.128711 0.129049 0.130692 0.126446 0.127653 0.126742 0.127005
qa: -0.0398 -0.0431 -0.2548 -0.3774 -0.2953 0.0000 0.0658 0.0432 -0.0827 -0.2405 -0.2451 -0.2077 0.3437 0.0532 0.3098 0.0124 -0.2565 -0.1385 -0.2038 0.2446 -0.0857 -0.2021 0.2480 -0.1693 -0.2040 -0.1080 -0.0941 -0.1400 0.0864 0.0836 0.0914 0.0930 0.0888 0.1007 0.0949 0.0740 0.0985 0.1182 0.1189 0.1233 0.1287 0.1290 0.1307 0.1264 0.1277 0.1267 0.1270
va: 1.2876 1.2623 2.1412 2.1270 2.1226 3.1193 3.7692 3.8232 3.8582 3.9159 3.9085 3.9251 4.2549 4.2498 3.8516 3.6374 4.0168 3.9162 4.0365 3.8698 3.9357 4.0347 3.7961 3.9654 4.0416 3.9505 3.9305 3.9595 1.0506 1.0345 1.0020 1.0028 1.0204 1.0024 1.0041 1.0101 1.0299 1.0185 1.0183 1.0167 0.9991 1.0121 1.0007 1.0134 0.9999 0.9991 1.0001
dispcorr: -0.024273598 hartree
energy: -2050.685393070591
dipole: 15.95532 -16.59701 -0.64169 22.72537 -22.31129 0.41407 14.58670 -13.39447 1.19223
magnitude: 1.41585 au
magnitude: 3.59882 debye
