program: Orca
programVersion: 5.0.2
elementType: Cl Cl O O O N C C C C C C C C C C C C C C C C C C C C C C H H H H H H H H H H H H H H H H H H H
charge: 0
multiplicity: 1
keywords: wb97x-d3
keywords: def2-TZVPP
keywords: def2/J RIJCOSX
keywords: DEFGRID2
keywords: scfconv7
keywords: smallprint printgap noloewdin
keywords: NOSOSCF
formula: C22H19Cl2NO3
InChI: InChI=1/C22H19Cl2NO3/c1-22(2)17(12-19(23)24)20(22)21(26)28-18(13-25)14-7-6-10-16(11-14)27-15-8-4-3-5-9-15/h3-12,17-18,20H,1-2H3
47 atoms
Cl -2.071911 0.003031 0.855218
Cl -4.260659 -0.898901 -0.790754
O  2.073519 -2.092125 0.353223
O  2.322154 -2.273928 -1.860334
O  0.139098 2.528767 1.064512
N  4.079061 -1.260174 2.845077
C  -0.198415 -4.124294 0.132786
C  -0.735225 -2.727068 0.101327
C  0.355274 -3.145113 -0.879422
C  0.596452 -4.55506 1.343203
C  -1.01266 -5.255004 -0.45335
C  -2.06383 -2.37402 -0.412456
C  1.675739 -2.482655 -0.873084
C  -2.705467 -1.24239 -0.14431
C  3.161994 -1.1796 0.400499
C  2.706896 0.210664 0.029012
C  3.662777 -1.231525 1.775355
C  1.633367 0.773958 0.704527
C  3.317954 0.89156 -1.01173
C  1.17146 2.02854 0.338389
C  2.858356 2.152719 -1.359003
C  1.789213 2.728685 -0.693794
C  -0.7230 3.432299 0.504945
C  -1.367445 3.171542 -0.697477
C  -0.98495 4.595089 1.211644
C  -2.278137 4.092501 -1.189908
C  -1.906452 5.503758 0.712162
C  -2.552068 5.259408 -0.489919
H  -0.384908 -2.097422 0.909983
H  0.029095 -3.321654 -1.897897
H  1.091589 -3.733512 1.852638
H  1.35594 -5.288079 1.066596
H  -0.072286 -5.030493 2.062532
H  -1.770172 -5.59149 0.256306
H  -0.366327 -6.104522 -0.677447
H  -1.518483 -4.986956 -1.380529
H  -2.567731 -3.071156 -1.070111
H  3.968978 -1.499835 -0.265952
H  1.145878 0.250728 1.518133
H  4.136182 0.438492 -1.555296
H  3.333635 2.695223 -2.164856
H  1.44171 3.713432 -0.976875
H  -1.168948 2.254648 -1.23733
H  -0.476269 4.777059 2.149178
H  -2.784972 3.888738 -2.123813
H  -2.114939 6.409142 1.266695
H  -3.268897 5.970471 -0.877608
totalener: -2050.65713363 hartree
nucrepener: 2895.63924306 hartree
electener: -4946.29637668 hartree
oneelecener: -8566.63308459 hartree
twoeener: 3620.33670791 hartree
kineticenergy: 2044.54357978 hartree
xcener: -151.874043839365 hartree
chargesum: -0.0000000
charge: -0.041307 -0.045675 -0.279095 -0.340397 -0.298854 0.003214 0.083278 0.017844 -0.053451 -0.236060 -0.271489 -0.198180 0.317495 0.062735 0.301305 0.038766 -0.270002 -0.218783 -0.126378 0.216338 -0.106446 -0.159859 0.255363 -0.173148 -0.205926 -0.118914 -0.095102 -0.137308 0.079366 0.086820 0.097174 0.091470 0.088080 0.102470 0.097261 0.076237 0.100119 0.121566 0.125783 0.109686 0.129086 0.134539 0.131613 0.127882 0.127968 0.126283 0.126633
qa: -0.0413 -0.0457 -0.2791 -0.3404 -0.2989 0.0032 0.0833 0.0178 -0.0535 -0.2361 -0.2715 -0.1982 0.3175 0.0627 0.3013 0.0388 -0.2700 -0.2188 -0.1264 0.2163 -0.1064 -0.1599 0.2554 -0.1731 -0.2059 -0.1189 -0.0951 -0.1373 0.0794 0.0868 0.0972 0.0915 0.0881 0.1025 0.0973 0.0762 0.1001 0.1216 0.1258 0.1097 0.1291 0.1345 0.1316 0.1279 0.1280 0.1263 0.1266
va: 1.3025 1.2603 2.0993 2.1689 2.0840 3.1146 3.7711 3.8245 3.7965 3.9064 3.9277 3.9284 4.2934 4.2320 3.8765 3.6724 4.0170 4.0384 4.0154 3.9075 3.9654 3.9516 3.7220 3.9577 4.0647 3.9744 3.9356 3.9611 1.0400 1.0287 1.0144 1.0031 1.0018 1.0007 1.0038 1.0087 1.0321 1.0176 1.0301 1.0150 1.0010 1.0040 1.0113 1.0127 1.0000 0.9990 0.9998
dispcorr: -0.027244520 hartree
energy: -2050.684378147372
dipole: 9.25156 -10.13179 -0.88024 -8.12421 8.01622 -0.10799 -3.77541 2.68644 -1.08896
magnitude: 1.40439 au
magnitude: 3.56968 debye
