program: Orca
programVersion: 5.0.2
elementType: Cl Cl O O O N C C C C C C C C C C C C C C C C C C C C C C H H H H H H H H H H H H H H H H H H H
charge: 0
multiplicity: 1
keywords: wb97x-d3
keywords: def2-TZVPP
keywords: def2/J RIJCOSX
keywords: DEFGRID2
keywords: scfconv7
keywords: smallprint printgap noloewdin
keywords: NOSOSCF
formula: C22H19Cl2NO3
InChI: InChI=1/C22H19Cl2NO3/c1-22(2)17(12-19(23)24)20(22)21(26)28-18(13-25)14-7-6-10-16(11-14)27-15-8-4-3-5-9-15/h3-12,17-18,20H,1-2H3
47 atoms
Cl -2.096425 -0.01651 0.71147
Cl -4.261807 -1.027452 -0.903645
O  2.064497 -2.075722 0.427319
O  2.355338 -2.280039 -1.779285
O  0.031546 2.506652 1.029159
N  4.02056 -1.18975 2.941921
C  -0.163055 -4.151063 0.202004
C  -0.729546 -2.767672 0.125578
C  0.392362 -3.183182 -0.820362
C  0.610017 -4.538141 1.441106
C  -0.938299 -5.312102 -0.377442
C  -2.054531 -2.457505 -0.424669
C  1.696628 -2.490006 -0.800526
C  -2.710386 -1.320239 -0.224061
C  3.139836 -1.148836 0.482895
C  2.675196 0.23329 0.092785
C  3.620836 -1.181438 1.865356
C  1.570002 0.78031 0.728641
C  3.316191 0.924891 -0.922777
C  1.103505 2.028877 0.346305
C  2.853616 2.180736 -1.283555
C  1.751562 2.740527 -0.658963
C  -0.779274 3.450698 0.457858
C  -1.004376 4.623585 1.159528
C  -1.408048 3.218061 -0.758258
C  -1.873452 5.572031 0.640014
C  -2.266772 4.177263 -1.270115
C  -2.502985 5.355553 -0.575762
H  -0.411589 -2.111055 0.926191
H  0.093012 -3.389526 -1.841405
H  1.389369 -5.263022 1.201019
H  -0.067752 -5.008914 2.155023
H  1.077398 -3.695932 1.942769
H  -1.705281 -5.649842 0.321389
H  -0.268457 -6.151708 -0.566933
H  -1.427016 -5.075895 -1.322312
H  -2.54345 -3.194796 -1.048966
H  3.961059 -1.464654 -0.168114
H  1.059612 0.248583 1.522389
H  4.160691 0.484549 -1.435832
H  3.351922 2.732029 -2.069272
H  1.402798 3.721143 -0.954144
H  -0.508311 4.783625 2.107734
H  -1.236856 2.293074 -1.293265
H  -2.053363 6.486223 1.189668
H  -2.761199 3.99623 -2.21522
H  -3.17874 6.097516 -0.978789
totalener: -2050.65721690 hartree
nucrepener: 2891.43004155 hartree
electener: -4942.08725846 hartree
oneelecener: -8558.22214264 hartree
twoeener: 3616.13488419 hartree
kineticenergy: 2044.54633646 hartree
xcener: -151.874542735441 hartree
chargesum: -0.0000000
charge: -0.041525 -0.045451 -0.279141 -0.340117 -0.300083 0.002709 0.085969 0.013285 -0.053289 -0.235677 -0.273509 -0.196545 0.316566 0.061593 0.298463 0.041237 -0.268703 -0.217424 -0.127754 0.218801 -0.108950 -0.161150 0.248376 -0.197735 -0.166114 -0.097846 -0.122806 -0.134799 0.080113 0.087025 0.091525 0.087938 0.096930 0.102778 0.097493 0.076253 0.100891 0.121736 0.126387 0.108989 0.128861 0.133951 0.127979 0.130547 0.126537 0.128629 0.127055
qa: -0.0415 -0.0455 -0.2791 -0.3401 -0.3001 0.0027 0.0860 0.0133 -0.0533 -0.2357 -0.2735 -0.1965 0.3166 0.0616 0.2985 0.0412 -0.2687 -0.2174 -0.1278 0.2188 -0.1089 -0.1611 0.2484 -0.1977 -0.1661 -0.0978 -0.1228 -0.1348 0.0801 0.0870 0.0915 0.0879 0.0969 0.1028 0.0975 0.0763 0.1009 0.1217 0.1264 0.1090 0.1289 0.1340 0.1280 0.1305 0.1265 0.1286 0.1271
va: 1.3056 1.2607 2.0987 2.1691 2.0832 3.1145 3.7715 3.8291 3.7953 3.9060 3.9282 3.9260 4.2946 4.2353 3.8779 3.6779 4.0167 4.0383 4.0170 3.9077 3.9695 3.9501 3.7299 4.0644 3.9649 3.9364 3.9768 3.9581 1.0386 1.0287 1.0032 1.0018 1.0145 1.0005 1.0039 1.0084 1.0318 1.0180 1.0299 1.0146 1.0011 1.0047 1.0123 1.0135 0.9991 1.0000 0.9998
dispcorr: -0.027143209 hartree
energy: -2050.684360113867
dipole: 9.73403 -10.58832 -0.85429 -7.70693 7.61759 -0.08934 -2.82425 1.75053 -1.07372
magnitude: 1.37502 au
magnitude: 3.49502 debye
