program: Orca
programVersion: 5.0.2
elementType: Cl Cl O O O N C C C C C C C C C C C C C C C C C C C C C C H H H H H H H H H H H H H H H H H H H
charge: 0
multiplicity: 1
keywords: wb97x-d3
keywords: def2-TZVPP
keywords: def2/J RIJCOSX
keywords: DEFGRID2
keywords: scfconv7
keywords: smallprint printgap noloewdin
keywords: NOSOSCF
formula: C22H19Cl2NO3
InChI: InChI=1/C22H19Cl2NO3/c1-22(2)17(12-19(23)24)20(22)21(26)28-18(13-25)14-7-6-10-16(11-14)27-15-8-4-3-5-9-15/h3-12,17-18,20H,1-2H3
47 atoms
Cl -4.176417 -4.385258 1.607283
Cl -3.163834 -6.80853 0.416424
O  0.60708 -0.904745 -0.920594
O  -1.023107 -0.38736 0.518339
O  1.659822 4.863054 0.511738
N  1.793281 0.416153 -3.702375
C  0.04755 -3.007798 1.917194
C  -1.244257 -3.297075 1.208624
C  -0.117893 -2.610369 0.461491
C  0.034058 -1.963192 3.004933
C  1.024823 -4.125585 2.188711
C  -1.615495 -4.658903 0.802978
C  -0.26331 -1.200546 0.062228
C  -2.819485 -5.201445 0.933504
C  0.654271 0.442996 -1.350898
C  1.45516 1.329725 -0.420737
C  1.293928 0.406238 -2.668441
C  1.15685 2.684241 -0.386705
C  2.491673 0.811244 0.345097
C  1.920793 3.529274 0.408236
C  3.223124 1.664718 1.157564
C  2.952393 3.023529 1.186534
C  1.311979 5.591608 -0.59423
C  1.895842 5.382166 -1.838239
C  0.383503 6.606684 -0.409302
C  1.528571 6.193383 -2.902433
C  0.036309 7.417638 -1.480063
C  0.600295 7.211693 -2.731723
H  -2.066092 -2.648404 1.489611
H  0.436941 -3.220297 -0.242482
H  0.988218 -1.43433 3.048484
H  -0.114925 -2.449932 3.970207
H  -0.756485 -1.225479 2.889687
H  2.016729 -3.716007 2.38711
H  1.12137 -4.822781 1.357348
H  0.719856 -4.693526 3.069284
H  -0.848429 -5.279462 0.354746
H  -0.351796 0.853094 -1.487556
H  0.334197 3.072241 -0.976494
H  2.735538 -0.242548 0.318775
H  4.027246 1.269871 1.764424
H  3.53374 3.690042 1.811032
H  2.632427 4.601899 -1.984615
H  -0.05868 6.761617 0.567278
H  1.981664 6.028609 -3.871759
H  -0.68678 8.209587 -1.332565
H  0.322171 7.841758 -3.566325
elementType: Cl O N C H
totalener: -2050.68645531 hartree
nucrepener: 2662.35080086 hartree
electener: -4713.03725618 hartree
oneelecener: -8099.88581165 hartree
twoeener: 3386.84855547 hartree
cpcmener: -0.03190981 hartree
kineticenergy: 2044.46277882 hartree
xcener: -151.862352065999 hartree
chargesum: 0.0000000
charge: -0.054502 -0.059140 -0.285221 -0.434534 -0.326966 -0.086093 0.091575 0.033257 -0.074729 -0.263349 -0.262227 -0.203949 0.369411 0.039064 0.398138 0.043948 -0.228995 -0.204045 -0.211616 0.258924 -0.130941 -0.215921 0.287730 -0.192481 -0.253042 -0.144335 -0.118032 -0.187407 0.082109 0.097999 0.096502 0.099950 0.095995 0.098386 0.090517 0.102372 0.131024 0.143865 0.145103 0.147145 0.158669 0.148458 0.154972 0.146491 0.159954 0.157720 0.158250
qa: -0.0545 -0.0591 -0.2852 -0.4345 -0.3270 -0.0861 0.0916 0.0333 -0.0747 -0.2633 -0.2622 -0.2039 0.3694 0.0391 0.3981 0.0439 -0.2290 -0.2040 -0.2116 0.2589 -0.1309 -0.2159 0.2877 -0.1925 -0.2530 -0.1443 -0.1180 -0.1874 0.0821 0.0980 0.0965 0.0999 0.0960 0.0984 0.0905 0.1024 0.1310 0.1439 0.1451 0.1471 0.1587 0.1485 0.1550 0.1465 0.1600 0.1577 0.1583
va: 1.2713 1.2456 2.1139 2.0763 2.0819 3.1142 3.7315 3.8848 3.8380 3.9032 3.9066 3.8942 4.2056 4.2130 3.7260 3.6218 4.0675 3.9916 3.9462 3.7435 3.9183 4.0058 3.6914 3.9051 4.0075 3.8932 3.8834 3.9087 1.0466 1.0337 1.0010 1.0011 1.0178 1.0017 1.0054 1.0008 1.0174 1.0204 1.0053 1.0121 0.9900 1.0045 0.9983 1.0081 0.9901 0.9891 0.9904
dispcorr: -0.023384659 hartree
energy: -2050.709839973071
dipole: 25.13523 -24.22908 0.90616 27.12093 -27.27791 -0.15698 5.58291 -4.40020 1.18270
magnitude: 1.49818 au
magnitude: 3.80807 debye
