program: Orca
programVersion: 5.0.2
elementType: Cl Cl O O O N C C C C C C C C C C C C C C C C C C C C C C H H H H H H H H H H H H H H H H H H H
charge: 0
multiplicity: 1
keywords: wb97x-d3
keywords: def2-TZVPP
keywords: def2/J RIJCOSX
keywords: DEFGRID2
keywords: scfconv7
keywords: smallprint printgap noloewdin
keywords: NOSOSCF
formula: C22H19Cl2NO3
InChI: InChI=1/C22H19Cl2NO3/c1-22(2)17(12-19(23)24)20(22)21(26)28-18(13-25)14-7-6-10-16(11-14)27-15-8-4-3-5-9-15/h3-12,17-18,20H,1-2H3
47 atoms
Cl -4.420923 -3.785603 0.470979
Cl -3.402845 -6.473871 0.230478
O  1.281477 -1.157476 -0.697674
O  -0.708348 -0.341437 -0.089079
O  1.306007 4.640224 0.564411
N  3.660402 -0.386063 -2.832682
C  -0.366443 -2.650035 2.058421
C  -1.417319 -3.006439 1.046653
C  -0.051831 -2.550007 0.576494
C  -0.583282 -1.40305 2.879428
C  0.364444 -3.733829 2.812818
C  -1.810486 -4.396622 0.786906
C  0.089302 -1.242175 -0.083664
C  -3.04353 -4.816325 0.53301
C  1.605737 0.091997 -1.290512
C  1.981882 1.136398 -0.263829
C  2.753313 -0.190545 -2.15617
C  1.4377 2.408799 -0.358085
C  2.878026 0.81698 0.749488
C  1.821364 3.38017 0.559716
C  3.231125 1.78992 1.670671
C  2.716481 3.07335 1.575632
C  0.946815 5.272562 -0.595365
C  1.723363 5.218938 -1.746644
C  -0.206665 6.043414 -0.554077
C  1.324053 5.93746 -2.865024
C  -0.585666 6.766677 -1.675697
C  0.171951 6.711932 -2.837393
H  -2.204288 -2.268551 0.938376
H  0.615751 -3.317864 0.201975
H  -1.088668 -1.664732 3.810677
H  -1.194815 -0.655992 2.378391
H  0.370424 -0.940505 3.14152
H  1.298046 -3.340242 3.21852
H  0.619406 -4.593377 2.194133
H  -0.236423 -4.08997 3.651667
H  -1.032963 -5.151363 0.789216
H  0.791875 0.453426 -1.927924
H  0.721685 2.63182 -1.139781
H  3.303613 -0.175957 0.822781
H  3.927266 1.553426 2.464451
H  3.003036 3.836328 2.288424
H  2.632688 4.631743 -1.778788
H  -0.796734 6.082098 0.353155
H  1.926897 5.894247 -3.762995
H  -1.48332 7.370389 -1.638314
H  -0.130062 7.271761 -3.71275
elementType: Cl O N C H
totalener: -2050.68667781 hartree
nucrepener: 2681.06437330 hartree
electener: -4731.75105111 hartree
oneelecener: -8137.45507098 hartree
twoeener: 3405.70401987 hartree
cpcmener: -0.03169348 hartree
kineticenergy: 2044.46591402 hartree
xcener: -151.862589629212 hartree
chargesum: -0.0000000
charge: -0.054739 -0.059945 -0.277692 -0.434685 -0.323721 -0.087383 0.090887 0.031050 -0.070363 -0.264034 -0.266511 -0.203472 0.369073 0.040832 0.403109 0.028778 -0.226893 -0.196186 -0.236840 0.281049 -0.122395 -0.226609 0.299890 -0.209636 -0.255403 -0.136203 -0.115376 -0.189906 0.079569 0.099573 0.100851 0.096075 0.096505 0.097968 0.091926 0.102694 0.129034 0.140193 0.145485 0.147307 0.158578 0.148397 0.158045 0.145593 0.159386 0.157878 0.158264
qa: -0.0547 -0.0599 -0.2777 -0.4347 -0.3237 -0.0874 0.0909 0.0311 -0.0704 -0.2640 -0.2665 -0.2035 0.3691 0.0408 0.4031 0.0288 -0.2269 -0.1962 -0.2368 0.2810 -0.1224 -0.2266 0.2999 -0.2096 -0.2554 -0.1362 -0.1154 -0.1899 0.0796 0.0996 0.1009 0.0961 0.0965 0.0980 0.0919 0.1027 0.1290 0.1402 0.1455 0.1473 0.1586 0.1484 0.1580 0.1456 0.1594 0.1579 0.1583
va: 1.2707 1.2447 2.1265 2.0805 2.0885 3.1115 3.7441 3.8790 3.8216 3.9052 3.9054 3.8982 4.2312 4.2137 3.7325 3.5911 4.0793 3.9701 3.9648 3.7419 3.9131 4.0072 3.6802 3.9237 4.0146 3.8857 3.8792 3.9112 1.0486 1.0320 1.0007 1.0172 1.0011 1.0015 1.0055 1.0008 1.0191 1.0185 1.0073 1.0124 0.9894 1.0054 0.9967 1.0087 0.9900 0.9890 0.9905
dispcorr: -0.023397925 hartree
energy: -2050.710075735381
dipole: 21.09146 -20.84923 0.24223 26.83561 -26.66066 0.17495 10.42978 -9.12964 1.30014
magnitude: 1.33403 au
magnitude: 3.39085 debye
