program: Orca
programVersion: 5.0.2
elementType: Cl Cl O O O N C C C C C C C C C C C C C C C C C C C C C C H H H H H H H H H H H H H H H H H H H
charge: 0
multiplicity: 1
keywords: wb97x-d3
keywords: def2-TZVPP
keywords: def2/J RIJCOSX
keywords: DEFGRID2
keywords: scfconv7
keywords: smallprint printgap noloewdin
keywords: NOSOSCF
formula: C22H19Cl2NO3
InChI: InChI=1/C22H19Cl2NO3/c1-22(2)17(12-19(23)24)20(22)21(26)28-18(13-25)14-7-6-10-16(11-14)27-15-8-4-3-5-9-15/h3-12,17-18,20H,1-2H3
47 atoms
Cl -3.160556 -0.971651 1.879472
Cl -4.793524 -0.549707 -0.461825
O  1.715385 -1.442831 0.347054
O  2.301488 -1.767668 -1.780491
O  1.13471 3.510555 -0.624338
N  3.194371 -0.773479 3.208995
C  -0.537615 -3.469225 -0.432147
C  -1.029084 -2.080348 -0.128467
C  0.081539 -2.27774 -1.136229
C  0.215522 -4.202452 0.649679
C  -1.373939 -4.381992 -1.29493
C  -2.333564 -1.599661 -0.607299
C  1.466503 -1.820367 -0.915057
C  -3.289228 -1.105434 0.168895
C  2.991483 -0.880216 0.606046
C  3.135979 0.511358 0.028743
C  3.092462 -0.831627 2.066683
C  2.029657 1.353658 0.001954
C  4.366387 0.931302 -0.448195
C  2.16426 2.628438 -0.529913
C  4.488279 2.217499 -0.959855
C  3.397281 3.06606 -1.007973
C  -0.109236 3.130933 -0.174598
C  -0.428756 3.275082 1.167178
C  -1.030759 2.633462 -1.083255
C  -1.696661 2.913549 1.601148
C  -2.298055 2.28037 -0.638245
C  -2.632666 2.416918 0.702205
H  -0.72519 -1.698445 0.83917
H  -0.196159 -2.185496 -2.180857
H  0.730747 -3.541133 1.34334
H  0.953602 -4.880916 0.217318
H  -0.481038 -4.805012 1.235252
H  -2.154348 -4.859515 -0.699328
H  -0.752401 -5.171756 -1.721038
H  -1.856186 -3.86322 -2.122725
H  -2.538078 -1.647777 -1.670689
H  3.795712 -1.526887 0.239487
H  1.076142 1.010887 0.383315
H  5.219671 0.265101 -0.428581
H  5.443451 2.558772 -1.337056
H  3.491375 4.063485 -1.418849
H  0.305363 3.66231 1.863681
H  -0.761483 2.527768 -2.126983
H  -1.95229 3.021209 2.647449
H  -3.023352 1.896706 -1.344509
H  -3.620391 2.140114 1.046564
elementType: Cl O N C H
totalener: -2050.68415325 hartree
nucrepener: 2929.10082064 hartree
electener: -4979.78497389 hartree
oneelecener: -8633.50199979 hartree
twoeener: 3653.71702590 hartree
cpcmener: -0.03189127 hartree
kineticenergy: 2044.46442160 hartree
xcener: -151.864635356211 hartree
chargesum: -0.0000000
charge: -0.055955 -0.059588 -0.279213 -0.428039 -0.325486 -0.085242 0.099856 0.055491 -0.106458 -0.268957 -0.263340 -0.222951 0.394431 0.040728 0.365311 0.005098 -0.228359 -0.194812 -0.231752 0.297583 -0.094969 -0.244723 0.233290 -0.168206 -0.175652 -0.156597 -0.159134 -0.137944 0.091297 0.099411 0.095108 0.102568 0.097372 0.101450 0.100127 0.089257 0.136305 0.147193 0.132584 0.143313 0.157171 0.146058 0.150503 0.149603 0.157866 0.150404 0.148001
qa: -0.0560 -0.0596 -0.2792 -0.4280 -0.3255 -0.0852 0.0999 0.0555 -0.1065 -0.2690 -0.2633 -0.2230 0.3944 0.0407 0.3653 0.0051 -0.2284 -0.1948 -0.2318 0.2976 -0.0950 -0.2447 0.2333 -0.1682 -0.1757 -0.1566 -0.1591 -0.1379 0.0913 0.0994 0.0951 0.1026 0.0974 0.1015 0.1001 0.0893 0.1363 0.1472 0.1326 0.1433 0.1572 0.1461 0.1505 0.1496 0.1579 0.1504 0.1480
va: 1.2662 1.2447 2.1124 2.0829 2.0961 3.1093 3.7472 3.7854 3.8987 3.9147 3.9100 3.8526 4.1645 4.1939 3.7633 3.6812 4.0673 3.9214 4.0055 3.7389 3.8924 4.0048 3.7267 3.9524 3.9905 3.9306 3.8294 3.8047 1.0360 1.0305 1.0107 0.9996 1.0011 1.0011 1.0017 1.0047 1.0134 1.0153 1.0270 1.0028 0.9889 1.0080 1.0002 1.0017 0.9913 1.0002 1.0091
dispcorr: -0.028865370 hartree
energy: -2050.713018616344
dipole: 14.40701 -14.88385 -0.47684 -9.58225 8.66082 -0.92142 -7.87124 6.61392 -1.25733
magnitude: 1.63011 au
magnitude: 4.14342 debye
