program: Orca
programVersion: 5.0.2
elementType: Cl Cl O O O N C C C C C C C C C C C C C C C C C C C C C C H H H H H H H H H H H H H H H H H H H
charge: 0
multiplicity: 1
keywords: wb97x-d3
keywords: def2-TZVPP
keywords: def2/J RIJCOSX
keywords: DEFGRID2
keywords: scfconv7
keywords: smallprint printgap noloewdin
keywords: NOSOSCF
formula: C22H19Cl2NO3
InChI: InChI=1/C22H19Cl2NO3/c1-22(2)17(12-19(23)24)20(22)21(26)28-18(13-25)14-7-6-10-16(11-14)27-15-8-4-3-5-9-15/h3-12,17-18,20H,1-2H3
47 atoms
Cl -3.691438 -4.471018 -1.084668
Cl -2.851528 -6.831015 0.345793
O  1.809043 -1.396098 0.263072
O  -0.067234 -0.823443 -0.807297
O  1.610821 4.215409 -1.484888
N  5.051592 -0.982324 -0.14299
C  -1.278032 -2.099083 1.843735
C  -1.516553 -2.98917 0.65681
C  -0.121041 -2.472501 0.936058
C  -1.863702 -0.709381 1.801938
C  -1.237852 -2.683834 3.234497
C  -1.761195 -4.429622 0.80117
C  0.488926 -1.48668 0.028147
C  -2.645699 -5.136845 0.109568
C  2.522149 -0.418114 -0.47912
C  2.244426 0.987442 0.001212
C  3.935539 -0.750098 -0.283958
C  1.999066 1.981309 -0.93103
C  2.243587 1.277752 1.360875
C  1.773218 3.284188 -0.505429
C  2.002551 2.579282 1.770993
C  1.773594 3.59142 0.849109
C  0.821045 5.31718 -1.291815
C  -0.447903 5.226488 -0.733232
C  1.310693 6.531606 -1.749997
C  -1.224499 6.372008 -0.633928
C  0.518021 7.66656 -1.654579
C  -0.749128 7.593399 -1.093002
H  -2.024476 -2.50646 -0.170573
H  0.58073 -3.17925 1.364663
H  -1.241879 -0.008824 2.363202
H  -2.851865 -0.717791 2.265645
H  -1.983606 -0.320357 0.792921
H  -0.710231 -2.007474 3.909494
H  -0.730122 -3.646487 3.279795
H  -2.248743 -2.819594 3.623598
H  -1.165427 -4.973355 1.524822
H  2.311687 -0.50255 -1.550758
H  1.987571 1.752719 -1.990109
H  2.4326 0.505763 2.096072
H  2.004351 2.817945 2.826432
H  1.60607 4.603947 1.193335
H  -0.835709 4.276682 -0.386433
H  2.300891 6.583916 -2.185223
H  -2.214491 6.303367 -0.201664
H  0.899182 8.612191 -2.01792
H  -1.364231 8.480347 -1.017473
elementType: Cl O N C H
totalener: -2050.68680359 hartree
nucrepener: 2665.72678234 hartree
electener: -4716.41358593 hartree
oneelecener: -8106.71726000 hartree
twoeener: 3390.30367407 hartree
cpcmener: -0.03200198 hartree
kineticenergy: 2044.46897739 hartree
xcener: -151.862805647434 hartree
chargesum: -0.0000000
charge: -0.054846 -0.059592 -0.278341 -0.433377 -0.323886 -0.087858 0.089002 0.034889 -0.073832 -0.262519 -0.264125 -0.203405 0.368908 0.039132 0.403741 0.034082 -0.226257 -0.234429 -0.231828 0.272076 -0.136243 -0.179230 0.278596 -0.192774 -0.244385 -0.143649 -0.122042 -0.180356 0.079022 0.099075 0.096000 0.100944 0.095406 0.098593 0.091157 0.102274 0.129738 0.141566 0.134621 0.147474 0.160436 0.157350 0.158641 0.145981 0.159296 0.157011 0.157961
qa: -0.0548 -0.0596 -0.2783 -0.4334 -0.3239 -0.0879 0.0890 0.0349 -0.0738 -0.2625 -0.2641 -0.2034 0.3689 0.0391 0.4037 0.0341 -0.2263 -0.2344 -0.2318 0.2721 -0.1362 -0.1792 0.2786 -0.1928 -0.2444 -0.1436 -0.1220 -0.1804 0.0790 0.0991 0.0960 0.1009 0.0954 0.0986 0.0912 0.1023 0.1297 0.1416 0.1346 0.1475 0.1604 0.1574 0.1586 0.1460 0.1593 0.1570 0.1580
va: 1.2706 1.2451 2.1254 2.0812 2.0807 3.1124 3.7450 3.8768 3.8265 3.9051 3.9045 3.8947 4.2305 4.2130 3.7231 3.6067 4.0793 4.0850 3.9642 3.7695 3.9135 3.9152 3.6903 3.9200 4.0092 3.8902 3.8848 3.9029 1.0482 1.0327 1.0011 1.0009 1.0171 1.0016 1.0054 1.0010 1.0185 1.0171 1.0190 1.0127 0.9904 0.9957 0.9964 1.0080 0.9902 0.9895 0.9905
dispcorr: -0.023289830 hartree
energy: -2050.710093417209
dipole: 6.00597 -7.22022 -1.21425 37.30115 -36.16278 1.13837 15.57446 -13.94646 1.62800
magnitude: 2.32823 au
magnitude: 5.91790 debye
