program: Orca
programVersion: 5.0.2
elementType: Cl Cl O O O N C C C C C C C C C C C C C C C C C C C C C C H H H H H H H H H H H H H H H H H H H
charge: 0
multiplicity: 1
keywords: wb97x-d3
keywords: def2-TZVPP
keywords: def2/J RIJCOSX
keywords: DEFGRID2
keywords: scfconv7
keywords: smallprint printgap noloewdin
keywords: NOSOSCF
formula: C22H19Cl2NO3
InChI: InChI=1/C22H19Cl2NO3/c1-22(2)17(12-19(23)24)20(22)21(26)28-18(13-25)14-7-6-10-16(11-14)27-15-8-4-3-5-9-15/h3-12,17-18,20H,1-2H3
47 atoms
Cl -2.241696 -0.114562 0.103376
Cl -4.421841 -1.574301 -1.100155
O  2.026756 -2.044761 0.373554
O  2.218676 -2.335259 -1.829076
O  -0.27193 2.387891 0.362481
N  3.957663 -0.880531 2.781443
C  -0.108791 -4.194335 0.410858
C  -0.776735 -2.878542 0.168331
C  0.37727 -3.326503 -0.730545
C  0.683385 -4.369075 1.685211
C  -0.790832 -5.471546 -0.021952
C  -2.124295 -2.757873 -0.404451
C  1.620458 -2.541696 -0.803403
C  -2.827326 -1.633504 -0.451247
C  3.079079 -1.09077 0.329861
C  2.585858 0.247286 -0.170182
C  3.560934 -0.987693 1.709105
C  1.408608 0.770916 0.347284
C  3.29187 0.929816 -1.149024
C  0.923192 1.975492 -0.139522
C  2.803482 2.142426 -1.61369
C  1.617783 2.66872 -1.125574
C  -0.598167 3.718928 0.378553
C  -1.82234 4.086892 -0.157923
C  0.234073 4.66047 0.971085
C  -2.220679 5.4151 -0.095262
C  -0.171657 5.985899 1.016479
C  -1.396942 6.368779 0.485805
H  -0.510152 -2.102681 0.87718
H  0.086801 -3.67766 -1.713935
H  0.997465 -3.431483 2.135531
H  1.570129 -4.982553 1.517309
H  0.064033 -4.885718 2.420416
H  -1.5474 -5.769873 0.705937
H  -0.059487 -6.278785 -0.088111
H  -1.271791 -5.395389 -0.996703
H  -2.592042 -3.643921 -0.815444
H  3.914319 -1.443276 -0.283736
H  0.856404 0.250905 1.1210
H  4.207298 0.51725 -1.552958
H  3.341617 2.679233 -2.383412
H  1.242018 3.603081 -1.521929
H  -2.459802 3.33921 -0.613081
H  1.184082 4.365384 1.399683
H  -3.177904 5.70288 -0.510347
H  0.473799 6.722261 1.477642
H  -1.708036 7.404143 0.528714
elementType: Cl O N C H
totalener: -2050.68272157 hartree
nucrepener: 2852.82676552 hartree
electener: -4903.50948709 hartree
oneelecener: -8481.37738296 hartree
twoeener: 3577.86789586 hartree
cpcmener: -0.03135083 hartree
kineticenergy: 2044.48191772 hartree
xcener: -151.866037849745 hartree
chargesum: -0.0000000
charge: -0.054747 -0.060108 -0.277129 -0.434944 -0.318142 -0.085669 0.117112 -0.030997 -0.047784 -0.257424 -0.292309 -0.183960 0.371982 0.046833 0.383832 0.029786 -0.232849 -0.256049 -0.201782 0.267036 -0.124586 -0.189989 0.258473 -0.224145 -0.179589 -0.134530 -0.146593 -0.171557 0.098771 0.098154 0.091297 0.101844 0.095681 0.105751 0.101230 0.091571 0.127286 0.142152 0.142231 0.145221 0.159906 0.154740 0.139399 0.159138 0.158240 0.159087 0.158128
qa: -0.0547 -0.0601 -0.2771 -0.4349 -0.3181 -0.0857 0.1171 -0.0310 -0.0478 -0.2574 -0.2923 -0.1840 0.3720 0.0468 0.3838 0.0298 -0.2328 -0.2560 -0.2018 0.2670 -0.1246 -0.1900 0.2585 -0.2241 -0.1796 -0.1345 -0.1466 -0.1716 0.0988 0.0982 0.0913 0.1018 0.0957 0.1058 0.1012 0.0916 0.1273 0.1422 0.1422 0.1452 0.1599 0.1547 0.1394 0.1591 0.1582 0.1591 0.1581
va: 1.3013 1.2467 2.1201 2.0763 2.0703 3.1076 3.7671 3.8938 3.8026 3.8974 3.9286 3.8693 4.2130 4.2207 3.7691 3.6403 4.0705 4.0452 3.9851 3.7705 3.9055 3.9291 3.7007 3.9938 3.9407 3.9000 3.8976 3.8960 1.0199 1.0270 1.0117 1.0010 1.0002 0.9987 1.0007 1.0035 1.0219 1.0154 1.0271 1.0028 0.9904 0.9973 1.0146 0.9958 0.9899 0.9900 0.9902
dispcorr: -0.026316788 hartree
energy: -2050.709038358172
dipole: 13.36182 -13.84786 -0.48604 -4.56342 4.28450 -0.27892 3.09838 -3.92940 -0.83103
magnitude: 1.00232 au
magnitude: 2.54769 debye
