program: Orca
programVersion: 5.0.2
elementType: Cl Cl O O O N C C C C C C C C C C C C C C C C C C C C C C H H H H H H H H H H H H H H H H H H H
charge: 0
multiplicity: 1
keywords: wb97x-d3
keywords: def2-TZVPP
keywords: def2/J RIJCOSX
keywords: DEFGRID2
keywords: scfconv7
keywords: smallprint printgap noloewdin
keywords: NOSOSCF
formula: C22H19Cl2NO3
InChI: InChI=1/C22H19Cl2NO3/c1-22(2)17(12-19(23)24)20(22)21(26)28-18(13-25)14-7-6-10-16(11-14)27-15-8-4-3-5-9-15/h3-12,17-18,20H,1-2H3
47 atoms
Cl -2.751933 0.087474 0.456554
Cl -4.598098 -0.89521 -1.528312
O  1.670089 -1.672691 0.287899
O  2.32758 -2.115235 -1.796698
O  0.737122 3.271082 -0.676705
N  3.086117 -0.790182 3.126252
C  -0.463106 -3.823654 -0.174746
C  -1.041022 -2.445211 -0.282697
C  0.172261 -2.823093 -1.12178
C  0.198118 -4.210327 1.12672
C  -1.1544 -4.988974 -0.84197
C  -2.313518 -2.169813 -0.96039
C  1.487832 -2.186466 -0.936435
C  -3.105842 -1.13689 -0.700141
C  2.889466 -0.99357 0.528038
C  2.920049 0.393252 -0.075222
C  2.987319 -0.89343 1.986807
C  1.767268 1.169108 -0.083585
C  4.115467 0.888434 -0.574264
C  1.828583 2.461261 -0.587261
C  4.157569 2.178812 -1.082084
C  3.021799 2.970892 -1.085678
C  -0.252001 3.256054 0.268969
C  -1.541524 3.501412 -0.182403
C  0.001823 3.076057 1.62363
C  -2.584785 3.563418 0.728752
C  -1.055269 3.125767 2.521406
C  -2.350047 3.367831 2.082549
H  -0.82576 -1.803859 0.563376
H  -0.02027 -3.020453 -2.170228
H  -0.524117 -4.739763 1.750826
H  0.557851 -3.361711 1.703584
H  1.038035 -4.885545 0.953567
H  -1.994078 -5.33539 -0.236614
H  -0.458426 -5.822547 -0.950626
H  -1.530767 -4.754631 -1.837161
H  -2.641583 -2.852417 -1.73527
H  3.747198 -1.577378 0.177548
H  0.833296 0.772954 0.295593
H  5.006043 0.272838 -0.569073
H  5.084306 2.573919 -1.476453
H  3.053152 3.979375 -1.478451
H  -1.724023 3.644257 -1.240269
H  1.006827 2.901799 1.986929
H  -3.588753 3.755243 0.372712
H  -0.857319 2.980833 3.575708
H  -3.167573 3.407452 2.790298
elementType: Cl O N C H
totalener: -2050.68356713 hartree
nucrepener: 2900.45571470 hartree
electener: -4951.13928183 hartree
oneelecener: -8576.45492362 hartree
twoeener: 3625.31564179 hartree
cpcmener: -0.03173161 hartree
kineticenergy: 2044.46808966 hartree
xcener: -151.866074517690 hartree
chargesum: -0.0000000
charge: -0.057598 -0.061844 -0.282352 -0.433259 -0.323269 -0.086879 0.097524 0.024038 -0.071380 -0.261498 -0.282756 -0.211276 0.393714 0.059773 0.377448 0.035565 -0.229307 -0.206989 -0.217836 0.290446 -0.103127 -0.243276 0.321829 -0.257857 -0.217274 -0.136594 -0.129824 -0.184530 0.087013 0.097631 0.096558 0.092547 0.101738 0.103909 0.099584 0.093618 0.127667 0.146019 0.132640 0.143850 0.158063 0.147730 0.143371 0.155919 0.154561 0.159345 0.156625
qa: -0.0576 -0.0618 -0.2824 -0.4333 -0.3233 -0.0869 0.0975 0.0240 -0.0714 -0.2615 -0.2828 -0.2113 0.3937 0.0598 0.3774 0.0356 -0.2293 -0.2070 -0.2178 0.2904 -0.1031 -0.2433 0.3218 -0.2579 -0.2173 -0.1366 -0.1298 -0.1845 0.0870 0.0976 0.0966 0.0925 0.1017 0.1039 0.0996 0.0936 0.1277 0.1460 0.1326 0.1439 0.1581 0.1477 0.1434 0.1559 0.1546 0.1593 0.1566
va: 1.2864 1.2442 2.1124 2.0783 2.0940 3.1063 3.7445 3.8450 3.8249 3.9114 3.9206 3.8950 4.1918 4.2075 3.7506 3.6208 4.0651 3.9727 3.9969 3.7194 3.8893 4.0039 3.6508 3.9765 3.9095 3.8612 3.8762 3.8653 1.0356 1.0279 1.0002 1.0100 1.0000 0.9995 1.0006 1.0054 1.0220 1.0174 1.0139 1.0027 0.9893 1.0059 1.0090 0.9980 0.9918 0.9897 0.9907
dispcorr: -0.027049918 hartree
energy: -2050.710617047184
dipole: 13.57291 -13.80267 -0.22976 -11.55137 10.45143 -1.09994 3.76513 -4.41096 -0.64583
magnitude: 1.29605 au
magnitude: 3.29431 debye
