program: Orca
programVersion: 5.0.2
elementType: Cl Cl O O O N C C C C C C C C C C C C C C C C C C C C C C H H H H H H H H H H H H H H H H H H H
charge: 0
multiplicity: 1
keywords: wb97x-d3
keywords: def2-TZVPP
keywords: def2/J RIJCOSX
keywords: DEFGRID2
keywords: scfconv7
keywords: smallprint printgap noloewdin
keywords: NOSOSCF
formula: C22H19Cl2NO3
InChI: InChI=1/C22H19Cl2NO3/c1-22(2)17(12-19(23)24)20(22)21(26)28-18(13-25)14-7-6-10-16(11-14)27-15-8-4-3-5-9-15/h3-12,17-18,20H,1-2H3
47 atoms
Cl -2.866491 0.123533 0.120648
Cl -4.40346 -1.01445 -2.037113
O  1.715988 -1.670724 0.462814
O  2.443606 -2.190729 -1.580769
O  0.70795 3.19572 -0.741824
N  3.036494 -0.665407 3.305909
C  -0.465494 -3.752499 0.056861
C  -0.996615 -2.389683 -0.272047
C  0.27483 -2.892325 -0.947547
C  0.070014 -3.985879 1.449849
C  -1.133974 -4.979601 -0.517756
C  -2.188172 -2.186667 -1.103756
C  1.577682 -2.236809 -0.744172
C  -3.030562 -1.166273 -1.005287
C  2.915592 -0.960865 0.711559
C  2.93708 0.405567 0.062984
C  2.975086 -0.812663 2.168514
C  1.766635 1.149002 -0.023941
C  4.141306 0.91652 -0.398269
C  1.81773 2.42413 -0.570768
C  4.173976 2.190494 -0.946263
C  3.019044 2.950365 -1.029763
C  -0.306146 3.212243 0.17651
C  -0.089779 3.090884 1.544198
C  -1.584443 3.423709 -0.320996
C  -1.173321 3.161735 2.408446
C  -2.65469 3.508512 0.556538
C  -2.457755 3.368544 1.923299
H  -0.840077 -1.649441 0.503555
H  0.160274 -3.211466 -1.977201
H  0.915214 -4.676375 1.434101
H  -0.711787 -4.440919 2.060349
H  0.382174 -3.077098 1.957353
H  -1.429199 -4.863862 -1.560066
H  -2.025942 -5.23423 0.057549
H  -0.4543 -5.832076 -0.468965
H  -2.40194 -2.919216 -1.872564
H  3.793438 -1.53919 0.404465
H  0.826348 0.741738 0.327066
H  5.046269 0.325863 -0.331317
H  5.107908 2.59788 -1.310052
H  3.042504 3.945643 -1.455306
H  0.905933 2.943925 1.943074
H  -1.738072 3.519725 -1.388733
H  -1.004668 3.06074 3.472913
H  -3.650127 3.671712 0.164032
H  -3.29621 3.423597 2.605069
elementType: Cl O N C H
totalener: -2050.68322373 hartree
nucrepener: 2900.75751058 hartree
electener: -4951.44073431 hartree
oneelecener: -8576.97479334 hartree
twoeener: 3625.53405903 hartree
cpcmener: -0.03189479 hartree
kineticenergy: 2044.46984062 hartree
xcener: -151.866619582077 hartree
chargesum: -0.0000000
charge: -0.055641 -0.063039 -0.281745 -0.434733 -0.323360 -0.087177 0.097668 0.032164 -0.071806 -0.263259 -0.277468 -0.212850 0.390698 0.057408 0.376203 0.036439 -0.229561 -0.203749 -0.215906 0.283868 -0.104572 -0.240663 0.323846 -0.213141 -0.257671 -0.137890 -0.151881 -0.170461 0.086989 0.095769 0.102265 0.096241 0.092070 0.092753 0.102429 0.099793 0.126419 0.145747 0.137498 0.143989 0.158141 0.147706 0.155702 0.142445 0.159457 0.155356 0.157509
qa: -0.0556 -0.0630 -0.2817 -0.4347 -0.3234 -0.0872 0.0977 0.0322 -0.0718 -0.2633 -0.2775 -0.2129 0.3907 0.0574 0.3762 0.0364 -0.2296 -0.2037 -0.2159 0.2839 -0.1046 -0.2407 0.3238 -0.2131 -0.2577 -0.1379 -0.1519 -0.1705 0.0870 0.0958 0.1023 0.0962 0.0921 0.0928 0.1024 0.0998 0.1264 0.1457 0.1375 0.1440 0.1581 0.1477 0.1557 0.1424 0.1595 0.1554 0.1575
va: 1.2873 1.2431 2.1131 2.0762 2.0931 3.1061 3.7310 3.8533 3.8291 3.9116 3.9204 3.8941 4.1961 4.2069 3.7552 3.6172 4.0641 3.9746 3.9970 3.7247 3.8885 4.0047 3.6477 3.9051 3.9595 3.8873 3.8569 3.8597 1.0319 1.0288 1.0003 1.0003 1.0102 1.0060 0.9999 1.0004 1.0224 1.0171 1.0090 1.0025 0.9893 1.0057 0.9979 1.0099 0.9899 0.9925 0.9897
dispcorr: -0.027058794 hartree
energy: -2050.710282525026
dipole: 13.02416 -13.22060 -0.19644 -10.79186 9.72316 -1.06870 7.16054 -7.67654 -0.51600
magnitude: 1.20290 au
magnitude: 3.05752 debye
