program: Orca
programVersion: 5.0.2
elementType: Cl Cl O O O N C C C C C C C C C C C C C C C C C C C C C C H H H H H H H H H H H H H H H H H H H
charge: 0
multiplicity: 1
keywords: wb97x-d3
keywords: def2-TZVPP
keywords: def2/J RIJCOSX
keywords: DEFGRID2
keywords: scfconv7
keywords: smallprint printgap noloewdin
keywords: NOSOSCF
formula: C22H19Cl2NO3
InChI: InChI=1/C22H19Cl2NO3/c1-22(2)17(12-19(23)24)20(22)21(26)28-18(13-25)14-7-6-10-16(11-14)27-15-8-4-3-5-9-15/h3-12,17-18,20H,1-2H3
47 atoms
Cl -2.382698 -6.007018 -1.223782
Cl -1.18486 -7.614876 0.85133
O  1.157923 -0.931367 0.545798
O  -0.467878 -1.134755 -0.974632
O  0.782693 4.596107 -1.753556
N  4.233225 0.249889 0.572639
C  -1.929994 -2.505968 1.468619
C  -1.434821 -3.557447 0.518758
C  -0.483465 -2.485298 1.01193
C  -2.916908 -1.493958 0.941261
C  -2.156961 -2.851015 2.920439
C  -1.189287 -4.940455 0.947246
C  0.021821 -1.472688 0.070693
C  -1.543409 -6.029927 0.278056
C  1.74231 0.114774 -0.207322
C  1.070006 1.452677 0.020336
C  3.134575 0.177235 0.245837
C  1.207763 2.432686 -0.952896
C  0.385577 1.71985 1.198006
C  0.649986 3.6857 -0.747221
C  -0.182079 2.973123 1.379798
C  -0.057331 3.961675 0.417271
C  0.976588 5.918112 -1.444682
C  0.233397 6.856485 -2.144344
C  1.921844 6.314288 -0.506208
C  0.441838 8.207502 -1.902473
C  2.111892 7.667249 -0.26744
C  1.374972 8.618322 -0.961071
H  -1.770448 -3.432515 -0.504542
H  0.234097 -2.790807 1.765111
H  -3.931257 -1.83109 1.161713
H  -2.851818 -1.345007 -0.13433
H  -2.779249 -0.526092 1.427171
H  -1.380324 -3.491909 3.336481
H  -3.114527 -3.359642 3.046165
H  -2.184219 -1.941114 3.522542
H  -0.664563 -5.093779 1.882691
H  1.756644 -0.12284 -1.276684
H  1.747413 2.227507 -1.870489
H  0.285272 0.970454 1.971764
H  -0.730969 3.184855 2.288029
H  -0.512263 4.931522 0.575212
H  -0.498245 6.531941 -2.873575
H  2.510062 5.580028 0.030406
H  -0.137377 8.940463 -2.449032
H  2.847929 7.977425 0.462998
H  1.530069 9.672068 -0.770405
elementType: Cl O N C H
totalener: -2050.68619919 hartree
nucrepener: 2631.69279190 hartree
electener: -4682.37899109 hartree
oneelecener: -8038.61255670 hartree
twoeener: 3356.23356561 hartree
cpcmener: -0.03215111 hartree
kineticenergy: 2044.46717185 hartree
xcener: -151.862583635888 hartree
chargesum: -0.0000000
charge: -0.054212 -0.059129 -0.285483 -0.435229 -0.328138 -0.086513 0.090615 0.031236 -0.075038 -0.263002 -0.260969 -0.200551 0.371106 0.037395 0.394575 0.042296 -0.226730 -0.242820 -0.199606 0.239427 -0.150467 -0.154597 0.245217 -0.228012 -0.164373 -0.130635 -0.152524 -0.172894 0.083599 0.096824 0.100048 0.095939 0.096843 0.090585 0.101951 0.098407 0.130356 0.144522 0.134692 0.147635 0.159860 0.159010 0.146297 0.158612 0.157396 0.158397 0.158083
qa: -0.0542 -0.0591 -0.2855 -0.4352 -0.3281 -0.0865 0.0906 0.0312 -0.0750 -0.2630 -0.2610 -0.2006 0.3711 0.0374 0.3946 0.0423 -0.2267 -0.2428 -0.1996 0.2394 -0.1505 -0.1546 0.2452 -0.2280 -0.1644 -0.1306 -0.1525 -0.1729 0.0836 0.0968 0.1000 0.0959 0.0968 0.0906 0.1020 0.0984 0.1304 0.1445 0.1347 0.1476 0.1599 0.1590 0.1463 0.1586 0.1574 0.1584 0.1581
va: 1.2716 1.2457 2.1112 2.0758 2.0692 3.1151 3.7321 3.8868 3.8420 3.9028 3.9069 3.8911 4.1969 4.2138 3.7216 3.6513 4.0672 4.1016 3.9485 3.7784 3.9276 3.8995 3.7179 3.9981 3.8995 3.8915 3.8979 3.8952 1.0455 1.0346 1.0009 1.0177 1.0008 1.0054 1.0010 1.0018 1.0174 1.0200 1.0174 1.0117 0.9919 0.9947 1.0071 0.9957 0.9895 0.9908 0.9901
dispcorr: -0.023092921 hartree
energy: -2050.709292106779
dipole: -3.74818 2.27912 -1.46906 42.61359 -41.48016 1.13343 11.38100 -9.99427 1.38673
magnitude: 2.31642 au
magnitude: 5.88787 debye
