program: Orca
programVersion: 5.0.2
elementType: Cl Cl O O O N C C C C C C C C C C C C C C C C C C C C C C H H H H H H H H H H H H H H H H H H H
charge: 0
multiplicity: 1
keywords: wb97x-d3
keywords: def2-TZVPP
keywords: def2/J RIJCOSX
keywords: DEFGRID2
keywords: scfconv7
keywords: smallprint printgap noloewdin
keywords: NOSOSCF
formula: C22H19Cl2NO3
InChI: InChI=1/C22H19Cl2NO3/c1-22(2)17(12-19(23)24)20(22)21(26)28-18(13-25)14-7-6-10-16(11-14)27-15-8-4-3-5-9-15/h3-12,17-18,20H,1-2H3
47 atoms
Cl -2.833037 0.215308 0.131165
Cl -4.54559 -0.94165 -1.876668
O  1.672883 -1.622712 0.242846
O  2.335425 -2.312393 -1.773591
O  0.813659 3.395973 -0.42203
N  3.233497 -0.907669 3.051429
C  -0.534468 -3.698046 0.05294
C  -1.05507 -2.339903 -0.308722
C  0.164125 -2.899554 -1.031944
C  0.075163 -3.879928 1.422913
C  -1.262361 -4.934216 -0.422009
C  -2.293346 -2.141619 -1.070075
C  1.490465 -2.268556 -0.917152
C  -3.106296 -1.1001 -0.942308
C  2.913961 -0.977867 0.457988
C  2.944003 0.43279 -0.085025
C  3.08013 -0.948003 1.91386
C  1.805542 1.227524 -0.009314
C  4.131813 0.934044 -0.594878
C  1.877682 2.547992 -0.431294
C  4.182406 2.251972 -1.026894
C  3.065022 3.063336 -0.940551
C  -0.212875 3.26141 0.474547
C  -1.493258 3.496898 -0.004681
C  0.000354 2.976829 1.818359
C  -2.570182 3.44581 0.868329
C  -1.088246 2.911789 2.675918
C  -2.375333 3.144403 2.20878
H  -0.834668 -1.570541 0.421092
H  -0.010933 -3.264472 -2.037651
H  0.902476 -4.591382 1.392197
H  -0.68038 -4.286841 2.097568
H  0.43592 -2.956926 1.869029
H  -2.127344 -5.135219 0.212722
H  -0.601917 -5.801143 -0.364792
H  -1.610952 -4.862488 -1.451707
H  -2.570426 -2.892854 -1.799733
H  3.744596 -1.559137 0.044527
H  0.87823 0.822941 0.377013
H  5.01047 0.304362 -0.653839
H  5.102987 2.653517 -1.429172
H  3.104052 4.094128 -1.269603
H  -1.643758 3.719847 -1.053607
H  0.999171 2.80837 2.201258
H  -3.567739 3.630166 0.49094
H  -0.92321 2.683889 3.721109
H  -3.218298 3.093635 2.885327
elementType: Cl O N C H
totalener: -2050.68322506 hartree
nucrepener: 2896.95369821 hartree
electener: -4947.63692326 hartree
oneelecener: -8569.25812705 hartree
twoeener: 3621.62120379 hartree
cpcmener: -0.03133879 hartree
kineticenergy: 2044.47692618 hartree
xcener: -151.868034593947 hartree
chargesum: -0.0000000
charge: -0.054481 -0.063343 -0.281518 -0.436571 -0.321565 -0.087976 0.099973 0.039503 -0.081538 -0.264838 -0.277622 -0.217456 0.396902 0.057193 0.373697 0.041440 -0.230146 -0.215830 -0.224064 0.303514 -0.101057 -0.248031 0.315743 -0.239410 -0.214402 -0.168421 -0.134133 -0.162826 0.085125 0.096590 0.102615 0.096603 0.090308 0.102162 0.099745 0.092876 0.127256 0.143122 0.136365 0.144912 0.157847 0.147314 0.143220 0.157670 0.156245 0.159502 0.157788
qa: -0.0545 -0.0633 -0.2815 -0.4366 -0.3216 -0.0880 0.1000 0.0395 -0.0815 -0.2648 -0.2776 -0.2175 0.3969 0.0572 0.3737 0.0414 -0.2301 -0.2158 -0.2241 0.3035 -0.1011 -0.2480 0.3157 -0.2394 -0.2144 -0.1684 -0.1341 -0.1628 0.0851 0.0966 0.1026 0.0966 0.0903 0.1022 0.0997 0.0929 0.1273 0.1431 0.1364 0.1449 0.1578 0.1473 0.1432 0.1577 0.1562 0.1595 0.1578
va: 1.2918 1.2434 2.1115 2.0760 2.0971 3.1062 3.7212 3.8471 3.8386 3.9132 3.9205 3.8993 4.1966 4.2106 3.7481 3.6502 4.0640 3.9657 3.9952 3.7189 3.8900 4.0002 3.6469 3.9580 3.9157 3.8492 3.8795 3.8457 1.0302 1.0283 0.9999 1.0005 1.0099 0.9998 1.0004 1.0059 1.0217 1.0225 1.0114 1.0021 0.9894 1.0068 1.0088 0.9968 0.9937 0.9895 0.9897
dispcorr: -0.026944298 hartree
energy: -2050.710169353730
dipole: 12.95483 -13.34530 -0.39047 -11.11250 10.21791 -0.89459 7.46377 -7.95491 -0.49114
magnitude: 1.09269 au
magnitude: 2.77740 debye
