program: Orca
programVersion: 5.0.2
elementType: Cl Cl O O O N C C C C C C C C C C C C C C C C C C C C C C H H H H H H H H H H H H H H H H H H H
charge: 0
multiplicity: 1
keywords: wb97x-d3
keywords: def2-TZVPP
keywords: def2/J RIJCOSX
keywords: DEFGRID2
keywords: scfconv7
keywords: smallprint printgap noloewdin
keywords: NOSOSCF
formula: C22H19Cl2NO3
InChI: InChI=1/C22H19Cl2NO3/c1-22(2)17(12-19(23)24)20(22)21(26)28-18(13-25)14-7-6-10-16(11-14)27-15-8-4-3-5-9-15/h3-12,17-18,20H,1-2H3
47 atoms
Cl -0.969304 -6.448008 1.083754
Cl -3.202799 -5.79253 2.78661
O  0.900186 -0.439621 0.926939
O  1.529102 -2.136888 -0.392953
O  0.562918 4.54196 -0.171047
N  2.818315 0.743145 3.355616
C  -1.55711 -2.437005 -0.840296
C  -1.121035 -3.418812 0.206393
C  -0.744635 -1.952911 0.345054
C  -0.935824 -2.548097 -2.210891
C  -2.992947 -1.971534 -0.885255
C  -2.056767 -3.980241 1.187984
C  0.67026 -1.563283 0.224053
C  -2.063901 -5.23415 1.621608
C  2.205717 0.122959 0.892361
C  2.236575 1.348635 0.01349
C  2.537863 0.45994 2.278496
C  1.366425 2.400341 0.271566
C  3.125609 1.415472 -1.048985
C  1.403288 3.533006 -0.52755
C  3.154278 2.556762 -1.838547
C  2.306274 3.622077 -1.583181
C  0.115874 5.456337 -1.087625
C  0.125898 6.789387 -0.704862
C  -0.395923 5.074192 -2.321521
C  -0.382732 7.750225 -1.567516
C  -0.88828 6.047342 -3.179272
C  -0.885118 7.385528 -2.808575
H  -0.306901 -4.068171 -0.095434
H  -1.304342 -1.385067 1.079375
H  0.049559 -3.007452 -2.204351
H  -0.849926 -1.565972 -2.679412
H  -1.576303 -3.161142 -2.847738
H  -3.416404 -1.780047 0.100006
H  -3.619374 -2.715859 -1.380548
H  -3.067954 -1.044148 -1.455516
H  -2.803894 -3.318769 1.610155
H  2.944789 -0.605348 0.546984
H  0.666519 2.356964 1.098621
H  3.794511 0.590003 -1.256043
H  3.852953 2.623641 -2.661992
H  2.360184 4.510094 -2.199426
H  0.522374 7.069786 0.26298
H  -0.417622 4.031835 -2.614371
H  -0.379045 8.789664 -1.265934
H  -1.284806 5.751803 -4.142033
H  -1.275494 8.137852 -3.481131
elementType: Cl O N C H
totalener: -2050.68635283 hartree
nucrepener: 2640.78696024 hartree
electener: -4691.47331307 hartree
oneelecener: -8056.74055842 hartree
twoeener: 3365.26724535 hartree
cpcmener: -0.03075727 hartree
kineticenergy: 2044.47194746 hartree
xcener: -151.863107343673 hartree
chargesum: 0.0000000
charge: -0.054460 -0.058995 -0.289466 -0.444513 -0.321376 -0.088552 0.090468 0.033651 -0.094606 -0.270167 -0.264932 -0.199856 0.403633 0.038948 0.420870 0.017979 -0.226946 -0.252419 -0.181152 0.269648 -0.137958 -0.188525 0.286415 -0.244018 -0.205074 -0.121840 -0.140072 -0.181423 0.081919 0.096003 0.095762 0.100987 0.097540 0.091518 0.101683 0.099081 0.129547 0.127801 0.135966 0.148298 0.160341 0.156879 0.146565 0.159148 0.157736 0.159311 0.158650
qa: -0.0545 -0.0590 -0.2895 -0.4445 -0.3214 -0.0886 0.0905 0.0337 -0.0946 -0.2702 -0.2649 -0.1999 0.4036 0.0389 0.4209 0.0180 -0.2269 -0.2524 -0.1812 0.2696 -0.1380 -0.1885 0.2864 -0.2440 -0.2051 -0.1218 -0.1401 -0.1814 0.0819 0.0960 0.0958 0.1010 0.0975 0.0915 0.1017 0.0991 0.1295 0.1278 0.1360 0.1483 0.1603 0.1569 0.1466 0.1591 0.1577 0.1593 0.1586
va: 1.2713 1.2459 2.1281 2.0696 2.0853 3.1093 3.7266 3.8718 3.8547 3.9072 3.9101 3.8948 4.1871 4.2159 3.6942 3.7036 4.0942 4.0818 3.9488 3.7938 3.9137 3.9141 3.6803 4.0138 3.9265 3.8839 3.8863 3.9045 1.0454 1.0339 1.0189 0.9991 1.0001 1.0057 1.0008 1.0013 1.0187 1.0323 1.0268 1.0020 0.9914 0.9962 1.0078 0.9957 0.9895 0.9902 0.9903
dispcorr: -0.022193604 hartree
energy: -2050.708546436874
dipole: 0.07155 -1.13279 -1.06124 36.36516 -35.06969 1.29548 -27.42066 24.79820 -2.62247
magnitude: 3.11156 au
magnitude: 7.90896 debye
