program: Orca
programVersion: 5.0.2
elementType: Cl Cl O O O N C C C C C C C C C C C C C C C C C C C C C C H H H H H H H H H H H H H H H H H H H
charge: 0
multiplicity: 1
keywords: wb97x-d3
keywords: def2-TZVPP
keywords: def2/J RIJCOSX
keywords: DEFGRID2
keywords: scfconv7
keywords: smallprint printgap noloewdin
keywords: NOSOSCF
formula: C22H19Cl2NO3
InChI: InChI=1/C22H19Cl2NO3/c1-22(2)17(12-19(23)24)20(22)21(26)28-18(13-25)14-7-6-10-16(11-14)27-15-8-4-3-5-9-15/h3-12,17-18,20H,1-2H3
47 atoms
Cl -0.354583 -6.610706 0.76104
Cl -2.674505 -6.496839 2.469945
O  0.58555 -0.383758 1.009141
O  1.444511 -1.99129 -0.293601
O  0.792403 4.878462 -0.095894
N  2.169017 1.054049 3.531632
C  -1.598518 -2.591892 -0.815231
C  -1.014525 -3.590591 0.140248
C  -0.8415 -2.105273 0.405997
C  -0.990081 -2.497545 -2.192909
C  -3.084171 -2.325346 -0.811437
C  -1.84432 -4.378227 1.059349
C  0.510686 -1.528866 0.309422
C  -1.641476 -5.649859 1.381607
C  1.844935 0.285946 1.055646
C  1.879311 1.437919 0.082942
C  2.013254 0.72124 2.443684
C  1.294633 2.655222 0.404642
C  2.465291 1.249788 -1.163343
C  1.319142 3.695535 -0.51433
C  2.472009 2.293479 -2.07581
C  1.909327 3.520975 -1.760974
C  0.309294 5.784919 -1.004917
C  0.778479 7.086946 -0.928406
C  -0.665033 5.430318 -1.929281
C  0.261091 8.048016 -1.78665
C  -1.165058 6.397879 -2.788092
C  -0.706077 7.707215 -2.721326
H  -0.121377 -4.085803 -0.22322
H  -1.461277 -1.676233 1.18521
H  -1.062334 -1.479615 -2.580302
H  -1.539331 -3.148446 -2.875355
H  0.05377 -2.799659 -2.228062
H  -3.512456 -2.287359 0.189552
H  -3.612099 -3.098046 -1.373389
H  -3.293834 -1.366734 -1.289189
H  -2.6922 -3.889495 1.524371
H  2.662252 -0.406149 0.835622
H  0.831106 2.817271 1.371263
H  2.919275 0.301163 -1.418426
H  2.933774 2.157668 -3.044811
H  1.946769 4.329355 -2.479876
H  1.53563 7.347079 -0.199372
H  -1.036502 4.413911 -1.977045
H  0.623851 9.065951 -1.725136
H  -1.925036 6.125295 -3.508936
H  -1.103665 8.45793 -3.391705
elementType: Cl O N C H
totalener: -2050.68664569 hartree
nucrepener: 2634.21325960 hartree
electener: -4684.89990529 hartree
oneelecener: -8043.67876642 hartree
twoeener: 3358.77886113 hartree
cpcmener: -0.02982757 hartree
kineticenergy: 2044.45869785 hartree
xcener: -151.860290471383 hartree
chargesum: -0.0000000
charge: -0.055056 -0.059714 -0.278591 -0.448016 -0.322322 -0.089402 0.086610 0.030823 -0.093345 -0.267170 -0.263406 -0.203639 0.413793 0.044604 0.406752 -0.008022 -0.224597 -0.220137 -0.170644 0.241960 -0.149951 -0.171441 0.253797 -0.224713 -0.180810 -0.132268 -0.146303 -0.170848 0.080225 0.098606 0.100052 0.098801 0.095048 0.091508 0.101580 0.098602 0.128898 0.133534 0.130037 0.146079 0.160625 0.156093 0.146786 0.159281 0.158247 0.159018 0.159035
qa: -0.0551 -0.0597 -0.2786 -0.4480 -0.3223 -0.0894 0.0866 0.0308 -0.0933 -0.2672 -0.2634 -0.2036 0.4138 0.0446 0.4068 -0.0080 -0.2246 -0.2201 -0.1706 0.2420 -0.1500 -0.1714 0.2538 -0.2247 -0.1808 -0.1323 -0.1463 -0.1708 0.0802 0.0986 0.1001 0.0988 0.0950 0.0915 0.1016 0.0986 0.1289 0.1335 0.1300 0.1461 0.1606 0.1561 0.1468 0.1593 0.1582 0.1590 0.1590
va: 1.2704 1.2450 2.1290 2.0643 2.0802 3.1087 3.7377 3.8626 3.8560 3.9074 3.9091 3.9035 4.1772 4.2125 3.7187 3.7320 4.0741 4.0999 3.9250 3.8186 3.9339 3.9046 3.7047 4.0062 3.9268 3.8887 3.8896 3.8947 1.0491 1.0323 0.9995 1.0001 1.0179 1.0058 1.0006 1.0014 1.0191 1.0231 1.0274 1.0123 0.9914 0.9972 1.0066 0.9953 0.9894 0.9903 0.9900
dispcorr: -0.022434848 hartree
energy: -2050.709080534788
dipole: -3.33455 2.14108 -1.19347 37.45121 -36.37425 1.07695 -25.78568 23.18379 -2.60189
magnitude: 3.05843 au
magnitude: 7.77392 debye
