program: Orca
programVersion: 5.0.2
elementType: Cl Cl O O O N C C C C C C C C C C C C C C C C C C C C C C H H H H H H H H H H H H H H H H H H H
charge: 0
multiplicity: 1
keywords: wb97x-d3
keywords: def2-TZVPP
keywords: def2/J RIJCOSX
keywords: DEFGRID2
keywords: scfconv7
keywords: smallprint printgap noloewdin
keywords: NOSOSCF
formula: C22H19Cl2NO3
InChI: InChI=1/C22H19Cl2NO3/c1-22(2)17(12-19(23)24)20(22)21(26)28-18(13-25)14-7-6-10-16(11-14)27-15-8-4-3-5-9-15/h3-12,17-18,20H,1-2H3
47 atoms
Cl -2.687557 0.349279 -0.500412
Cl -4.376342 -1.132515 -2.305372
O  1.645732 -1.573099 0.364449
O  2.435602 -2.546578 -1.485527
O  0.807701 3.418493 -0.421089
N  3.153582 -0.851611 3.205709
C  -0.576079 -3.634709 0.298951
C  -1.053347 -2.333897 -0.273161
C  0.202998 -2.990914 -0.833589
C  -0.054954 -3.639484 1.71721
C  -1.284728 -4.920712 -0.057105
C  -2.237523 -2.236529 -1.135293
C  1.532642 -2.368523 -0.709675
C  -2.988547 -1.151761 -1.283071
C  2.885665 -0.936149 0.606418
C  2.932422 0.470326 0.053001
C  3.024926 -0.89816 2.065128
C  1.789319 1.261647 0.06846
C  4.140479 0.970937 -0.408516
C  1.87549 2.576754 -0.36794
C  4.206252 2.284188 -0.852715
C  3.082987 3.091673 -0.827996
C  -0.262638 3.281534 0.422335
C  -0.112099 3.047837 1.783984
C  -1.522278 3.460785 -0.130931
C  -1.241955 2.979045 2.586506
C  -2.642108 3.405819 0.687101
C  -2.508583 3.156228 2.045642
H  -0.872692 -1.472792 0.358585
H  0.087505 -3.484259 -1.791843
H  0.786978 -4.326057 1.824229
H  -0.844807 -3.986418 2.386016
H  0.256473 -2.660952 2.073594
H  -0.64048 -5.774171 0.161031
H  -1.559528 -4.986436 -1.109199
H  -2.193702 -5.033161 0.536698
H  -2.527895 -3.111759 -1.703957
H  3.721394 -1.522332 0.211376
H  0.84754 0.858652 0.418794
H  5.02316 0.344196 -0.420943
H  5.1430 2.68515 -1.216459
H  3.133087 4.118704 -1.167307
H  0.870354 2.922758 2.222168
H  -1.623483 3.645629 -1.19309
H  -1.125679 2.792308 3.646321
H  -3.623346 3.548206 0.252816
H  -3.384048 3.102853 2.679254
elementType: Cl O N C H
totalener: -2050.68313863 hartree
nucrepener: 2894.83784357 hartree
electener: -4945.52098219 hartree
oneelecener: -8564.93868072 hartree
twoeener: 3619.41769853 hartree
cpcmener: -0.03110453 hartree
kineticenergy: 2044.46690907 hartree
xcener: -151.866356413301 hartree
chargesum: -0.0000000
charge: -0.051093 -0.063814 -0.281158 -0.437810 -0.321469 -0.088753 0.106472 0.027854 -0.079375 -0.265340 -0.283879 -0.208953 0.399355 0.048608 0.371249 0.044593 -0.227399 -0.210743 -0.225222 0.300773 -0.102327 -0.245883 0.333749 -0.210881 -0.284235 -0.139801 -0.153429 -0.154874 0.087437 0.096990 0.103593 0.097121 0.088860 0.100559 0.093083 0.103077 0.126405 0.140032 0.135550 0.144701 0.158037 0.147343 0.157283 0.144220 0.159415 0.161718 0.158365
qa: -0.0511 -0.0638 -0.2812 -0.4378 -0.3215 -0.0888 0.1065 0.0279 -0.0794 -0.2653 -0.2839 -0.2090 0.3994 0.0486 0.3712 0.0446 -0.2274 -0.2107 -0.2252 0.3008 -0.1023 -0.2459 0.3337 -0.2109 -0.2842 -0.1398 -0.1534 -0.1549 0.0874 0.0970 0.1036 0.0971 0.0889 0.1006 0.0931 0.1031 0.1264 0.1400 0.1356 0.1447 0.1580 0.1473 0.1573 0.1442 0.1594 0.1617 0.1584
va: 1.2964 1.2428 2.1113 2.0759 2.0948 3.1055 3.7232 3.8592 3.8292 3.9121 3.9228 3.8884 4.1975 4.2178 3.7353 3.6806 4.0630 3.9625 3.9912 3.7223 3.8909 4.0008 3.6082 3.9227 3.9413 3.8857 3.8105 3.8730 1.0240 1.0280 0.9994 1.0007 1.0104 1.0001 1.0056 0.9995 1.0226 1.0285 1.0122 1.0020 0.9894 1.0068 0.9967 1.0123 0.9899 0.9911 0.9887
dispcorr: -0.026860570 hartree
energy: -2050.709999196370
dipole: 11.54465 -12.02374 -0.47909 -10.36605 9.58992 -0.77613 11.62436 -11.96480 -0.34044
magnitude: 0.97355 au
magnitude: 2.47457 debye
