program: Orca
programVersion: 5.0.2
elementType: Cl Cl O O O N C C C C C C C C C C C C C C C C C C C C C C H H H H H H H H H H H H H H H H H H H
charge: 0
multiplicity: 1
keywords: wb97x-d3
keywords: def2-TZVPP
keywords: def2/J RIJCOSX
keywords: DEFGRID2
keywords: scfconv7
keywords: smallprint printgap noloewdin
keywords: NOSOSCF
formula: C22H19Cl2NO3
InChI: InChI=1/C22H19Cl2NO3/c1-22(2)17(12-19(23)24)20(22)21(26)28-18(13-25)14-7-6-10-16(11-14)27-15-8-4-3-5-9-15/h3-12,17-18,20H,1-2H3
47 atoms
Cl -0.028644 -5.119224 1.405558
Cl -2.627697 -6.368266 1.573246
O  1.121259 -0.87143 1.194624
O  1.267938 -1.781889 -0.84011
O  -0.338245 3.441448 -0.80986
N  3.126354 0.71184 3.281485
C  -1.889568 -1.6473 -0.447048
C  -1.387193 -3.052487 -0.456395
C  -0.728396 -2.053928 0.456991
C  -1.651381 -0.778951 -1.656547
C  -3.177755 -1.335926 0.273666
C  -2.180458 -4.159569 0.121971
C  0.637225 -1.59347 0.167193
C  -1.679061 -5.087188 0.924261
C  2.340318 -0.18616 0.957666
C  2.167936 0.965179 -0.010033
C  2.764305 0.309814 2.268489
C  1.016553 1.73983 0.042946
C  3.161428 1.242551 -0.936739
C  0.851274 2.778479 -0.86099
C  2.989911 2.297698 -1.821612
C  1.835888 3.064796 -1.800342
C  -0.405673 4.779343 -1.093973
C  -1.480475 5.20963 -1.858013
C  0.517042 5.68787 -0.590272
C  -1.633202 6.563974 -2.117866
C  0.35849 7.037473 -0.869268
C  -0.712789 7.482272 -1.63229
H  -0.801807 -3.330868 -1.32983
H  -0.974782 -2.105163 1.51155
H  -0.761676 -1.055722 -2.218979
H  -1.558527 0.271402 -1.372664
H  -2.501497 -0.85987 -2.336702
H  -3.316984 -1.946479 1.166319
H  -4.035038 -1.50196 -0.381924
H  -3.197694 -0.289665 0.583546
H  -3.229239 -4.234158 -0.143022
H  3.118588 -0.86732 0.597395
H  0.236393 1.542044 0.768516
H  4.056839 0.63553 -0.978092
H  3.755832 2.514875 -2.554368
H  1.707205 3.866188 -2.516545
H  -2.194294 4.490052 -2.239088
H  1.348475 5.35496 0.018404
H  -2.474863 6.898229 -2.710469
H  1.077462 7.745765 -0.478031
H  -0.830862 8.536934 -1.842712
elementType: Cl O N C H
totalener: -2050.68401029 hartree
nucrepener: 2747.01393727 hartree
electener: -4797.69794755 hartree
oneelecener: -8269.62778816 hartree
twoeener: 3471.92984061 hartree
cpcmener: -0.03058967 hartree
kineticenergy: 2044.48344714 hartree
xcener: -151.865198738205 hartree
chargesum: 0.0000000
charge: -0.049109 -0.056278 -0.280677 -0.428268 -0.330312 -0.086801 0.142455 -0.015568 -0.148448 -0.273503 -0.280900 -0.228339 0.370613 0.078198 0.413627 0.048207 -0.230948 -0.283052 -0.204225 0.281369 -0.121625 -0.187895 0.265193 -0.239667 -0.183677 -0.128698 -0.151538 -0.175514 0.110730 0.117369 0.097625 0.093372 0.103583 0.094727 0.102736 0.100307 0.140071 0.143880 0.136983 0.145113 0.160057 0.158924 0.146788 0.157953 0.158100 0.159168 0.157895
qa: -0.0491 -0.0563 -0.2807 -0.4283 -0.3303 -0.0868 0.1425 -0.0156 -0.1484 -0.2735 -0.2809 -0.2283 0.3706 0.0782 0.4136 0.0482 -0.2309 -0.2831 -0.2042 0.2814 -0.1216 -0.1879 0.2652 -0.2397 -0.1837 -0.1287 -0.1515 -0.1755 0.1107 0.1174 0.0976 0.0934 0.1036 0.0947 0.1027 0.1003 0.1401 0.1439 0.1370 0.1451 0.1601 0.1589 0.1468 0.1580 0.1581 0.1592 0.1579
va: 1.2798 1.2493 2.1122 2.0806 2.0524 3.1130 3.7127 3.8744 3.8218 3.8910 3.9114 3.9080 4.2000 4.1892 3.7086 3.5874 4.0808 4.0418 4.0009 3.7166 3.9009 3.9339 3.7142 4.0027 3.9073 3.8920 3.8960 3.8977 1.0235 1.0226 1.0150 1.0028 1.0027 0.9987 0.9998 1.0035 1.0090 1.0153 1.0279 1.0026 0.9904 0.9946 1.0068 0.9969 0.9895 0.9905 0.9904
dispcorr: -0.025276894 hartree
energy: -2050.709287179962
dipole: -6.03089 4.84950 -1.18139 39.77961 -38.79119 0.98842 -19.29181 17.36768 -1.92412
magnitude: 2.46473 au
magnitude: 6.26485 debye
