program: Orca
programVersion: 5.0.2
elementType: Cl Cl O O O N C C C C C C C C C C C C C C C C C C C C C C H H H H H H H H H H H H H H H H H H H
charge: 0
multiplicity: 1
keywords: wb97x-d3
keywords: def2-TZVPP
keywords: def2/J RIJCOSX
keywords: DEFGRID2
keywords: scfconv7
keywords: smallprint printgap noloewdin
keywords: NOSOSCF
formula: C22H19Cl2NO3
InChI: InChI=1/C22H19Cl2NO3/c1-22(2)17(12-19(23)24)20(22)21(26)28-18(13-25)14-7-6-10-16(11-14)27-15-8-4-3-5-9-15/h3-12,17-18,20H,1-2H3
47 atoms
Cl -3.775542 -3.511887 -1.392908
Cl -3.274536 -5.907638 0.133174
O  1.889517 -1.073311 0.115334
O  0.103961 -0.130829 -0.847803
O  1.799526 4.526817 -0.029807
N  4.9443 -1.623587 -0.983631
C  -1.368469 -1.313808 1.655368
C  -1.598384 -2.206242 0.471626
C  -0.182871 -1.803207 0.844229
C  -1.840146 0.116157 1.553186
C  -1.483676 -1.873329 3.052787
C  -1.983706 -3.61477 0.621857
C  0.567361 -0.910482 -0.055759
C  -2.885385 -4.248422 -0.117244
C  2.757282 -0.235328 -0.649434
C  3.000273 1.069731 0.06641
C  3.983975 -1.015324 -0.823749
C  2.322086 2.199673 -0.368399
C  3.823532 1.127573 1.185755
C  2.442458 3.385134 0.345589
C  3.965515 2.327725 1.863309
C  3.269014 3.45653 1.457616
C  0.532874 4.46676 -0.548408
C  0.226809 5.363176 -1.562062
C  -0.431902 3.594231 -0.057091
C  -1.05651 5.385084 -2.089437
C  -1.706514 3.619004 -0.603854
C  -2.025973 4.509903 -1.619985
H  -1.996873 -1.699564 -0.400058
H  0.419368 -2.562061 1.330823
H  -2.85058 0.191256 1.959606
H  -1.87524 0.485751 0.531269
H  -1.201104 0.780532 2.138198
H  -2.530675 -1.927112 3.357213
H  -0.966541 -1.223448 3.760762
H  -1.054893 -2.869409 3.155092
H  -1.494975 -4.194979 1.395405
H  2.347948 -0.053806 -1.647816
H  1.698842 2.147353 -1.25191
H  4.356641 0.249692 1.529991
H  4.613403 2.384674 2.727927
H  3.367106 4.388972 1.999159
H  0.987135 6.040395 -1.930959
H  -0.203414 2.901687 0.743467
H  -1.293436 6.08696 -2.878619
H  -2.456107 2.936651 -0.223265
H  -3.022719 4.523495 -2.040747
elementType: Cl O N C H
totalener: -2050.68615580 hartree
nucrepener: 2762.08874127 hartree
electener: -4812.77489706 hartree
oneelecener: -8299.24924326 hartree
twoeener: 3486.47434620 hartree
cpcmener: -0.03035674 hartree
kineticenergy: 2044.46777214 hartree
xcener: -151.863097842859 hartree
chargesum: -0.0000000
charge: -0.054981 -0.059175 -0.275273 -0.448382 -0.326625 -0.087355 0.104992 0.037223 -0.100613 -0.282434 -0.263446 -0.206894 0.415143 0.041861 0.398875 -0.000407 -0.224206 -0.180974 -0.212130 0.278478 -0.122556 -0.228499 0.296509 -0.249543 -0.212048 -0.121111 -0.138906 -0.187497 0.083186 0.098387 0.102338 0.084361 0.103764 0.101458 0.099039 0.091781 0.130107 0.135389 0.144131 0.142532 0.159772 0.147950 0.145453 0.165197 0.157260 0.160228 0.157640
qa: -0.0550 -0.0592 -0.2753 -0.4484 -0.3266 -0.0874 0.1050 0.0372 -0.1006 -0.2824 -0.2634 -0.2069 0.4151 0.0419 0.3989 -0.0004 -0.2242 -0.1810 -0.2121 0.2785 -0.1226 -0.2285 0.2965 -0.2495 -0.2120 -0.1211 -0.1389 -0.1875 0.0832 0.0984 0.1023 0.0844 0.1038 0.1015 0.0990 0.0918 0.1301 0.1354 0.1441 0.1425 0.1598 0.1480 0.1455 0.1652 0.1573 0.1602 0.1576
va: 1.2708 1.2459 2.1352 2.0601 2.0912 3.1102 3.7130 3.8642 3.8721 3.9139 3.9076 3.8996 4.1705 4.2139 3.7444 3.6449 4.0628 3.9138 3.9977 3.7413 3.9088 4.0261 3.7096 4.0059 3.9057 3.8875 3.8847 3.9302 1.0443 1.0331 1.0024 1.0157 0.9965 1.0011 1.0015 1.0057 1.0185 1.0187 1.0166 1.0085 0.9895 1.0053 1.0083 0.9859 0.9888 0.9896 0.9910
dispcorr: -0.025148572 hartree
energy: -2050.711304368131
dipole: 6.55374 -7.53324 -0.97950 30.25763 -29.35160 0.90603 15.07559 -13.44641 1.62918
magnitude: 2.10583 au
magnitude: 5.35260 debye
