program: Gaussian 09
title: 000072775
version: EM64L-G09RevD.01
frameworkgroup: C1[X(C14H7ClN2O6)]
method: RPBEPBE
basis: SDD
operation: Freq
keyword: #p
keyword: freq=noraman
keyword: PBEPBE/SDD
title: #p freq=noraman PBEPBE/SDD
converged: YES YES YES YES
title: Mulliken charges:
elementType: Cl O O O O O O N N C C C C C C C C C C C C C C H H H H H H H
charge: -0.042008 -0.228668 -0.228668 -0.465597 -0.465598 -0.193216 -0.193216 -0.451037 -0.451036 0.473226 0.473226 0.184921 0.184920 -0.610926 -0.634567 0.128120 0.128122 0.246829 0.246830 -0.391313 -0.391315 0.111188 0.111188 0.327069 0.367153 0.367154 0.293294 0.293294 0.405316 0.405316
chargesum: 0.00000
title: Mulliken charges with hydrogens summed into heavy atoms:
elementType: Cl O O O O O O N N C C C C C C C C C C C C C C
charge: -0.042008 -0.228668 -0.228668 -0.060281 -0.060282 -0.193216 -0.193216 -0.083884 -0.083882 0.473226 0.473226 0.184921 0.184920 -0.610926 -0.307497 0.128120 0.128122 0.246829 0.246830 -0.098019 -0.098021 0.111188 0.111188
polarizability: 3.47773257e+02 7.31332444e-05 2.53031869e+02 -3.44143762e-03 -6.96025021e-04 7.26919097e+01
1716.lowfreq: 0.0006 0.0010 0.0011 3.1010 4.9169 4.9725 36.3646 44.0671 66.5911
frequency: 36.3583 44.0668 66.5911 67.8384 91.8448 105.3821 124.4443 131.6528 163.7454 179.2980 182.5123 192.9651 207.7471 266.9024 273.1955 317.9501 318.9386 338.2752 368.3994 391.2477 416.2858 465.0183 493.9317 501.8170 514.0711 528.6446 529.2217 549.9079 581.5581 601.6806 601.9431 608.1920 613.4457 631.4220 669.6831 690.0084 737.6717 738.6328 741.8873 742.9083 769.8670 770.0680 776.5849 800.7099 806.2421 906.3401 906.5642 929.4103 948.1348 994.4802 1026.0388 1028.7211 1064.8961 1101.0690 1113.5075 1124.3641 1225.3007 1235.6894 1249.3216 1274.0025 1276.7961 1337.5814 1344.7113 1357.3741 1402.8127 1411.0465 1459.1098 1494.2773 1504.0682 1537.2616 1554.4352 1568.5871 1611.2388 1620.4527 1643.1586 1672.2308 1673.0036 3159.8007 3191.6510 3191.7055 3502.6411 3504.7435 3554.0943 3554.1901
redmass: 13.1850 10.1570 11.7824 11.0369 9.5864 13.2531 8.8824 11.8119 6.0365 5.9079 4.7986 10.7098 12.1997 11.0529 12.9668 16.5203 6.4878 8.7419 7.3936 9.7779 10.5074 4.3924 3.1053 8.3835 9.9326 8.9645 3.0459 7.6403 4.9834 2.0686 4.4352 1.4644 2.4062 4.8984 3.8041 6.2400 4.5800 2.7395 1.3311 1.7165 5.6387 9.1920 5.3853 6.4653 5.2739 1.5047 1.5391 9.5913 6.9898 1.4094 3.4400 2.7368 3.1673 3.4264 1.7478 1.8635 1.7285 4.1654 2.3069 2.1814 2.7479 6.4497 2.3371 1.7344 5.3945 4.4115 5.2363 3.2349 11.2595 9.3280 10.4725 3.7099 8.0021 7.3112 7.3583 9.7772 9.7674 1.0917 1.0931 1.0931 1.0773 1.0774 1.0650 1.0650
irintensity: 0.0071 0.0000 0.0000 2.4004 0.1013 2.9922 0.0000 0.4715 0.2833 2.0665 0.0000 0.0403 4.0507 6.6281 2.6397 0.1928 0.3550 0.0000 25.5671 9.1759 10.2570 30.2954 0.0000 0.0552 0.9077 12.8151 60.2928 0.0563 40.5215 0.0088 18.1398 245.6304 0.0000 16.9935 5.4191 23.3693 0.0000 155.4052 0.0000 61.4727 0.0036 60.2478 10.4011 0.8498 6.1035 81.9491 0.0016 216.5037 15.0404 12.9481 175.3039 0.5848 16.3470 339.1481 61.2902 44.8920 25.0411 1.1385 37.4833 70.1789 123.3009 1.1838 46.7747 23.4709 93.5169 33.7221 2.4113 513.0969 75.9357 93.2253 296.1975 1.9158 243.2683 96.9259 119.0731 544.5896 1.3877 8.8396 6.4912 1.8174 18.7192 220.3525 49.1290 111.5454
temp: 298.150 k
press: 1.00000 atm
elementType: 17 8 8 8 8 8 8 7 7 6 6 6 6 6 6 6 6 6 6 6 6 6 6 1 1 1 1 1 1 1
symmnumber: 1
zpe: 508446.2 jmol-1
zpe.correction: 0.193657 hartree
zpe.thermalcorrener: 0.212657 hartree
zpe.thermalcorrenthalpy: 0.213601 hartree
zpe.thermalcorrgfe: 0.145600 hartree
zpe.sumelectzpe: -1557.062647 hartree
zpe.sumelectthermal: -1557.043647 hartree
zpe.sumelectthermalent: -1557.042702 hartree
zpe.sumelectthermalfe: -1557.110704 hartree
dipole: 0.0000 -10.8521 0.0000
dipole: 10.8521
quadrupole: -142.8293 -148.9272 -136.9964
quadrupole: 0.0000 0.0013 -0.0014
quadrupole: 0.0883 -6.0095 5.9212 0.0000 0.0013 -0.0014
hfenergy: -1557.2563035 hartree
pointgroup: C01 [X(C14H7Cl1N2O6)]
dipole: -0.0000173 -4.2695275 -0.0000189 debye
polarizability: 347.7732572|-0.0004532|253.0318689|-0.0034414|0.000696|72.6919097 unknown
InChI: InChI=1S/C14H7ClN2O6/c15-10-11-4(8(18)2-6(16-11)13(20)21)1-5-9(19)3-7(14(22)23)17-12(5)10/h1-3,16-17,20,22H
charge 0 multiplicity 1
30 atoms
Cl -0.000014 -2.842259 0.000307
O  -2.561661 3.151291 0.000274
O  2.561679 3.151268 0.000122
O  -4.558048 -2.534391 -0.000085
O  4.55802 -2.534428 0.000083
O  -6.069437 -0.754309 0.00012
O  6.069425 -0.754357 0.000048
N  -2.443619 -1.005143 0.000315
N  2.443606 -1.005164 0.000195
C  -1.234211 -0.320842 0.000249
C  1.234205 -0.320852 0.000192
C  -1.231267 1.119924 0.000199
C  1.231274 1.119914 0.000148
C  -0.000006 -1.007136 0.000243
C  0.000006 1.803149 0.000154
C  -2.521735 1.876532 0.000185
C  2.521744 1.876512 0.000087
C  -3.660674 -0.32982 0.000353
C  3.660664 -0.329849 0.000165
C  -3.733595 1.049704 0.000307
C  3.733595 1.049674 0.000121
C  -4.893389 -1.167367 0.000466
C  4.893373 -1.167405 0.00019
H  0.000012 2.89834 0.000111
H  -2.457767 -2.030217 0.000376
H  2.457747 -2.030238 0.000241
H  -4.710559 1.538606 0.000352
H  4.710563 1.538569 0.000104
H  -5.380603 -3.091031 -0.000407
H  5.380572 -3.091074 -0.000016
